Debian 9 Stretch 64bits

Logs

====== Attempt #1

-----> Fetching repository

Cloning into '/tmp/d20181026-11-o07pfc/input'...

-----> Setting up package repository...

-----> Starting packaging process

-----> Starting service postgres...

-----> Additional environment variables

UUID=811cb8b5-59cd-4ee2-b421-1b7a56abcfb1

DATABASE_URL=postgres://postgres:9PIXSISSWQLHtL4O@8.26.94.84:32788/postgres

DATABASE_HOST=8.26.94.84

DATABASE_PORT=32788

HOME=/home/pkgr

-----> Empty or invalid cache

-----> Fetching pkgr 6802d07ced92047cb5ed20b9ff79f204cc423bac...

-----> Starting packaging process...

-----> Installing missing build dependencies: libsqlite3-dev

-----> [wizard] adding legacy-installer wizard (https://github.com/pkgr/addon-legacy-installer#master)

-----> [wizard] adding mysql wizard (https://github.com/pkgr/addon-mysql#master)

-----> [wizard] adding apache2 wizard (https://github.com/pkgr/addon-apache2#master)

-----> [wizard] adding repositories wizard (https://github.com/finnlabs/addon-repositories#master)

-----> [wizard] adding smtp wizard (https://github.com/pkgr/addon-smtp#master)

-----> [wizard] adding memcached wizard (https://github.com/pkgr/addon-memcached#master)

-----> [wizard] adding openproject wizard (https://github.com/pkgr/addon-openproject#master)

-----> Fetching buildpack https://github.com/opf/heroku-buildpack-multi.git at master

-----> Running hook: "packaging/setup"

-----> Multipack app

WARNING: This buildpack is no longer maintained.

Please choose a different buildpack or go to https://github.com/ddollar/heroku-buildpack-multi

and fork it to your own account.

=====> Downloading Buildpack: https://github.com/pkgr/pkgr-buildpack-imagemagick.git

=====> Detected Framework: ImageMagick

-----> SKIP

=====> Downloading Buildpack: https://github.com/heroku/heroku-buildpack-nodejs.git

=====> Detected Framework: Node.js

-----> Creating runtime environment

NPM_CONFIG_LOGLEVEL=error

NPM_CONFIG_PRODUCTION=true

NODE_ENV=production

NODE_MODULES_CACHE=true

NODE_VERBOSE=false

-----> Installing binaries

engines.node (package.json): >= 6.9.1

engines.npm (package.json): >= 4.0.0

Resolving node version >= 6.9.1 via semver.io...

Downloading and installing node 11.0.0...

Resolving npm version >= 4.0.0 via semver.io...

npm 6.4.1 already installed with node

-----> Restoring cache

Skipping cache restore (new-signature)

-----> Building dependencies

Installing node modules (package.json)

> openproject@0.1.0 postinstall /tmp/d20181026-47-hl4t7z/opt/openproject

> cd frontend && npm install

> @uirouter/core@5.0.17 install /tmp/d20181026-47-hl4t7z/opt/openproject/frontend/node_modules/@uirouter/core

> node migrate/migratewarn.js

> node-sass@4.9.3 install /tmp/d20181026-47-hl4t7z/opt/openproject/frontend/node_modules/node-sass

> node scripts/install.js

Downloading binary from https://github.com/sass/node-sass/releases/download/v4.9.3/linux-x64-67_binding.node

Cannot download "https://github.com/sass/node-sass/releases/download/v4.9.3/linux-x64-67_binding.node":

HTTP error 404 Not Found

Hint: If github.com is not accessible in your location

try setting a proxy via HTTP_PROXY, e.g.

export HTTP_PROXY=http://example.com:1234

or configure npm proxy via

npm config set proxy http://example.com:8080

> node-sass@4.9.3 postinstall /tmp/d20181026-47-hl4t7z/opt/openproject/frontend/node_modules/node-sass

> node scripts/build.js

Building: /tmp/d20181026-47-hl4t7z/opt/openproject/.heroku/node/bin/node /tmp/d20181026-47-hl4t7z/opt/openproject/frontend/node_modules/node-gyp/bin/node-gyp.js rebuild --verbose --libsass_ext= --libsass_cflags= --libsass_ldflags= --libsass_library=

gyp info it worked if it ends with ok

gyp verb cli [ '/tmp/d20181026-47-hl4t7z/opt/openproject/.heroku/node/bin/node',

gyp verb cli '/tmp/d20181026-47-hl4t7z/opt/openproject/frontend/node_modules/node-gyp/bin/node-gyp.js',

gyp verb cli 'rebuild',

gyp verb cli '--verbose',

gyp verb cli '--libsass_ext=',

gyp verb cli '--libsass_cflags=',

gyp verb cli '--libsass_ldflags=',

gyp verb cli '--libsass_library=' ]

gyp info using node-gyp@3.8.0

gyp info using node@11.0.0 | linux | x64

gyp verb command rebuild []

gyp verb command clean []

gyp verb clean removing "build" directory

gyp verb command configure []

gyp verb check python checking for Python executable "python2" in the PATH

gyp verb `which` failed Error: not found: python2

gyp verb `which` failed at getNotFoundError (/tmp/d20181026-47-hl4t7z/opt/openproject/frontend/node_modules/which/which.js:13:12)

gyp verb `which` failed at F (/tmp/d20181026-47-hl4t7z/opt/openproject/frontend/node_modules/which/which.js:68:19)

gyp verb `which` failed at E (/tmp/d20181026-47-hl4t7z/opt/openproject/frontend/node_modules/which/which.js:80:29)

gyp verb `which` failed at /tmp/d20181026-47-hl4t7z/opt/openproject/frontend/node_modules/which/which.js:89:16

gyp verb `which` failed at /tmp/d20181026-47-hl4t7z/opt/openproject/frontend/node_modules/isexe/index.js:42:5

gyp verb `which` failed at /tmp/d20181026-47-hl4t7z/opt/openproject/frontend/node_modules/isexe/mode.js:8:5

gyp verb `which` failed at FSReqCallback.oncomplete (fs.js:161:21)

gyp verb `which` failed python2 { Error: not found: python2

gyp verb `which` failed at getNotFoundError (/tmp/d20181026-47-hl4t7z/opt/openproject/frontend/node_modules/which/which.js:13:12)

gyp verb `which` failed at F (/tmp/d20181026-47-hl4t7z/opt/openproject/frontend/node_modules/which/which.js:68:19)

gyp verb `which` failed at E (/tmp/d20181026-47-hl4t7z/opt/openproject/frontend/node_modules/which/which.js:80:29)

gyp verb `which` failed at /tmp/d20181026-47-hl4t7z/opt/openproject/frontend/node_modules/which/which.js:89:16

gyp verb `which` failed at /tmp/d20181026-47-hl4t7z/opt/openproject/frontend/node_modules/isexe/index.js:42:5

gyp verb `which` failed at /tmp/d20181026-47-hl4t7z/opt/openproject/frontend/node_modules/isexe/mode.js:8:5

gyp verb `which` failed at FSReqCallback.oncomplete (fs.js:161:21)

gyp verb `which` failed stack:

gyp verb `which` failed 'Error: not found: python2n at getNotFoundError (/tmp/d20181026-47-hl4t7z/opt/openproject/frontend/node_modules/which/which.js:13:12)n at F (/tmp/d20181026-47-hl4t7z/opt/openproject/frontend/node_modules/which/which.js:68:19)n at E (/tmp/d20181026-47-hl4t7z/opt/openproject/frontend/node_modules/which/which.js:80:29)n at /tmp/d20181026-47-hl4t7z/opt/openproject/frontend/node_modules/which/which.js:89:16n at /tmp/d20181026-47-hl4t7z/opt/openproject/frontend/node_modules/isexe/index.js:42:5n at /tmp/d20181026-47-hl4t7z/opt/openproject/frontend/node_modules/isexe/mode.js:8:5n at FSReqCallback.oncomplete (fs.js:161:21)',

gyp verb `which` failed code: 'ENOENT' }

gyp verb check python checking for Python executable "python" in the PATH

gyp verb `which` failed Error: not found: python

gyp verb `which` failed at getNotFoundError (/tmp/d20181026-47-hl4t7z/opt/openproject/frontend/node_modules/which/which.js:13:12)

gyp verb `which` failed at F (/tmp/d20181026-47-hl4t7z/opt/openproject/frontend/node_modules/which/which.js:68:19)

gyp verb `which` failed at E (/tmp/d20181026-47-hl4t7z/opt/openproject/frontend/node_modules/which/which.js:80:29)

gyp verb `which` failed at /tmp/d20181026-47-hl4t7z/opt/openproject/frontend/node_modules/which/which.js:89:16

gyp verb `which` failed at /tmp/d20181026-47-hl4t7z/opt/openproject/frontend/node_modules/isexe/index.js:42:5

gyp verb `which` failed at /tmp/d20181026-47-hl4t7z/opt/openproject/frontend/node_modules/isexe/mode.js:8:5

gyp verb `which` failed at FSReqCallback.oncomplete (fs.js:161:21)

gyp verb `which` failed python { Error: not found: python

gyp verb `which` failed at getNotFoundError (/tmp/d20181026-47-hl4t7z/opt/openproject/frontend/node_modules/which/which.js:13:12)

gyp verb `which` failed at F (/tmp/d20181026-47-hl4t7z/opt/openproject/frontend/node_modules/which/which.js:68:19)

gyp verb `which` failed at E (/tmp/d20181026-47-hl4t7z/opt/openproject/frontend/node_modules/which/which.js:80:29)

gyp verb `which` failed at /tmp/d20181026-47-hl4t7z/opt/openproject/frontend/node_modules/which/which.js:89:16

gyp verb `which` failed at /tmp/d20181026-47-hl4t7z/opt/openproject/frontend/node_modules/isexe/index.js:42:5

gyp verb `which` failed at /tmp/d20181026-47-hl4t7z/opt/openproject/frontend/node_modules/isexe/mode.js:8:5

gyp verb `which` failed at FSReqCallback.oncomplete (fs.js:161:21)

gyp verb `which` failed stack:

gyp verb `which` failed 'Error: not found: pythonn at getNotFoundError (/tmp/d20181026-47-hl4t7z/opt/openproject/frontend/node_modules/which/which.js:13:12)n at F (/tmp/d20181026-47-hl4t7z/opt/openproject/frontend/node_modules/which/which.js:68:19)n at E (/tmp/d20181026-47-hl4t7z/opt/openproject/frontend/node_modules/which/which.js:80:29)n at /tmp/d20181026-47-hl4t7z/opt/openproject/frontend/node_modules/which/which.js:89:16n at /tmp/d20181026-47-hl4t7z/opt/openproject/frontend/node_modules/isexe/index.js:42:5n at /tmp/d20181026-47-hl4t7z/opt/openproject/frontend/node_modules/isexe/mode.js:8:5n at FSReqCallback.oncomplete (fs.js:161:21)',

gyp verb `which` failed code: 'ENOENT' }

gyp ERR! configure error

gyp ERR! stack Error: Can't find Python executable "python", you can set the PYTHON env variable.

gyp ERR! stack at PythonFinder.failNoPython (/tmp/d20181026-47-hl4t7z/opt/openproject/frontend/node_modules/node-gyp/lib/configure.js:484:19)

gyp ERR! stack at PythonFinder.<anonymous> (/tmp/d20181026-47-hl4t7z/opt/openproject/frontend/node_modules/node-gyp/lib/configure.js:406:16)

gyp ERR! stack at F (/tmp/d20181026-47-hl4t7z/opt/openproject/frontend/node_modules/which/which.js:68:16)

gyp ERR! stack at E (/tmp/d20181026-47-hl4t7z/opt/openproject/frontend/node_modules/which/which.js:80:29)

gyp ERR! stack at /tmp/d20181026-47-hl4t7z/opt/openproject/frontend/node_modules/which/which.js:89:16

gyp ERR! stack at /tmp/d20181026-47-hl4t7z/opt/openproject/frontend/node_modules/isexe/index.js:42:5

gyp ERR! stack at /tmp/d20181026-47-hl4t7z/opt/openproject/frontend/node_modules/isexe/mode.js:8:5

gyp ERR! stack at FSReqCallback.oncomplete (fs.js:161:21)

gyp ERR! System Linux 4.9.120-xxxx-std-ipv6-64

gyp ERR! command "/tmp/d20181026-47-hl4t7z/opt/openproject/.heroku/node/bin/node" "/tmp/d20181026-47-hl4t7z/opt/openproject/frontend/node_modules/node-gyp/bin/node-gyp.js" "rebuild" "--verbose" "--libsass_ext=" "--libsass_cflags=" "--libsass_ldflags=" "--libsass_library="

gyp ERR! cwd /tmp/d20181026-47-hl4t7z/opt/openproject/frontend/node_modules/node-sass

gyp ERR! node -v v11.0.0

gyp ERR! node-gyp -v v3.8.0

gyp ERR! not ok

Build failed with error code: 1

npm ERR! code ELIFECYCLE

npm ERR! errno 1

npm ERR! node-sass@4.9.3 postinstall: `node scripts/build.js`

npm ERR! Exit status 1

npm ERR!

npm ERR! Failed at the node-sass@4.9.3 postinstall script.

npm ERR! This is probably not a problem with npm. There is likely additional logging output above.

npm ERR! A complete log of this run can be found in:

npm ERR! /home/pkgr/.npm/_logs/2018-10-26T11_50_19_768Z-debug.log

npm ERR! code ELIFECYCLE

npm ERR! errno 1

npm ERR! openproject@0.1.0 postinstall: `cd frontend && npm install`

npm ERR! Exit status 1

npm ERR!

npm ERR! Failed at the openproject@0.1.0 postinstall script.

npm ERR! This is probably not a problem with npm. There is likely additional logging output above.

npm ERR! A complete log of this run can be found in:

npm ERR! /home/pkgr/.npm/_logs/2018-10-26T11_50_19_925Z-debug.log

-----> Build failed

We're sorry this build is failing! You can troubleshoot common issues here:

https://devcenter.heroku.com/articles/troubleshooting-node-deploys

Some possible problems:

- Dangerous semver range (>) in engines.node

https://devcenter.heroku.com/articles/nodejs-support#specifying-a-node-js-version

Love,

Heroku

! ERROR: compile failed

Failed to package application

tar: This does not look like a tar archive

tar: Exiting with failure status due to previous errors

! FAILED - Build error.

! Please contact support.

====== Attempt #2

-----> Fetching repository

Cloning into '/tmp/d20181026-11-9av2o9/input'...

-----> Setting up package repository...

-----> Starting packaging process

-----> Starting service postgres...

-----> Additional environment variables

UUID=5eac9206-893a-4acf-9f72-24ff4e4b7bcd

DATABASE_URL=postgres://postgres:WRxoJSebE64_JEZn@8.26.94.84:32793/postgres

DATABASE_HOST=8.26.94.84

DATABASE_PORT=32793

HOME=/home/pkgr

-----> Empty or invalid cache

-----> Fetching pkgr 6802d07ced92047cb5ed20b9ff79f204cc423bac...

-----> Starting packaging process...

-----> Installing missing build dependencies: libsqlite3-dev

-----> [wizard] adding legacy-installer wizard (https://github.com/pkgr/addon-legacy-installer#master)

-----> [wizard] adding mysql wizard (https://github.com/pkgr/addon-mysql#master)

-----> [wizard] adding apache2 wizard (https://github.com/pkgr/addon-apache2#master)

-----> [wizard] adding repositories wizard (https://github.com/finnlabs/addon-repositories#master)

-----> [wizard] adding smtp wizard (https://github.com/pkgr/addon-smtp#master)

-----> [wizard] adding memcached wizard (https://github.com/pkgr/addon-memcached#master)

-----> [wizard] adding openproject wizard (https://github.com/pkgr/addon-openproject#master)

-----> Fetching buildpack https://github.com/opf/heroku-buildpack-multi.git at master

-----> Running hook: "packaging/setup"

-----> Multipack app

WARNING: This buildpack is no longer maintained.

Please choose a different buildpack or go to https://github.com/ddollar/heroku-buildpack-multi

and fork it to your own account.

=====> Downloading Buildpack: https://github.com/pkgr/pkgr-buildpack-imagemagick.git

=====> Detected Framework: ImageMagick

-----> SKIP

=====> Downloading Buildpack: https://github.com/heroku/heroku-buildpack-nodejs.git

=====> Detected Framework: Node.js

-----> Creating runtime environment

NPM_CONFIG_LOGLEVEL=error

NPM_CONFIG_PRODUCTION=true

NODE_ENV=production

NODE_MODULES_CACHE=true

NODE_VERBOSE=false

-----> Installing binaries

engines.node (package.json): >= 6.9.1

engines.npm (package.json): >= 4.0.0

Resolving node version >= 6.9.1 via semver.io...

Downloading and installing node 11.0.0...

Resolving npm version >= 4.0.0 via semver.io...

npm 6.4.1 already installed with node

-----> Restoring cache

Skipping cache restore (new-signature)

-----> Building dependencies

Installing node modules (package.json)

> openproject@0.1.0 postinstall /tmp/d20181026-47-123vy6y/opt/openproject

> cd frontend && npm install

> @uirouter/core@5.0.17 install /tmp/d20181026-47-123vy6y/opt/openproject/frontend/node_modules/@uirouter/core

> node migrate/migratewarn.js

> node-sass@4.9.3 install /tmp/d20181026-47-123vy6y/opt/openproject/frontend/node_modules/node-sass

> node scripts/install.js

Downloading binary from https://github.com/sass/node-sass/releases/download/v4.9.3/linux-x64-67_binding.node

Cannot download "https://github.com/sass/node-sass/releases/download/v4.9.3/linux-x64-67_binding.node":

HTTP error 404 Not Found

Hint: If github.com is not accessible in your location

try setting a proxy via HTTP_PROXY, e.g.

export HTTP_PROXY=http://example.com:1234

or configure npm proxy via

npm config set proxy http://example.com:8080

> node-sass@4.9.3 postinstall /tmp/d20181026-47-123vy6y/opt/openproject/frontend/node_modules/node-sass

> node scripts/build.js

Building: /tmp/d20181026-47-123vy6y/opt/openproject/.heroku/node/bin/node /tmp/d20181026-47-123vy6y/opt/openproject/frontend/node_modules/node-gyp/bin/node-gyp.js rebuild --verbose --libsass_ext= --libsass_cflags= --libsass_ldflags= --libsass_library=

gyp info it worked if it ends with ok

gyp verb cli [ '/tmp/d20181026-47-123vy6y/opt/openproject/.heroku/node/bin/node',

gyp verb cli '/tmp/d20181026-47-123vy6y/opt/openproject/frontend/node_modules/node-gyp/bin/node-gyp.js',

gyp verb cli 'rebuild',

gyp verb cli '--verbose',

gyp verb cli '--libsass_ext=',

gyp verb cli '--libsass_cflags=',

gyp verb cli '--libsass_ldflags=',

gyp verb cli '--libsass_library=' ]

gyp info using node-gyp@3.8.0

gyp info using node@11.0.0 | linux | x64

gyp verb command rebuild []

gyp verb command clean []

gyp verb clean removing "build" directory

gyp verb command configure []

gyp verb check python checking for Python executable "python2" in the PATH

gyp verb `which` failed Error: not found: python2

gyp verb `which` failed at getNotFoundError (/tmp/d20181026-47-123vy6y/opt/openproject/frontend/node_modules/which/which.js:13:12)

gyp verb `which` failed at F (/tmp/d20181026-47-123vy6y/opt/openproject/frontend/node_modules/which/which.js:68:19)

gyp verb `which` failed at E (/tmp/d20181026-47-123vy6y/opt/openproject/frontend/node_modules/which/which.js:80:29)

gyp verb `which` failed at /tmp/d20181026-47-123vy6y/opt/openproject/frontend/node_modules/which/which.js:89:16

gyp verb `which` failed at /tmp/d20181026-47-123vy6y/opt/openproject/frontend/node_modules/isexe/index.js:42:5

gyp verb `which` failed at /tmp/d20181026-47-123vy6y/opt/openproject/frontend/node_modules/isexe/mode.js:8:5

gyp verb `which` failed at FSReqCallback.oncomplete (fs.js:161:21)

gyp verb `which` failed python2 { Error: not found: python2

gyp verb `which` failed at getNotFoundError (/tmp/d20181026-47-123vy6y/opt/openproject/frontend/node_modules/which/which.js:13:12)

gyp verb `which` failed at F (/tmp/d20181026-47-123vy6y/opt/openproject/frontend/node_modules/which/which.js:68:19)

gyp verb `which` failed at E (/tmp/d20181026-47-123vy6y/opt/openproject/frontend/node_modules/which/which.js:80:29)

gyp verb `which` failed at /tmp/d20181026-47-123vy6y/opt/openproject/frontend/node_modules/which/which.js:89:16

gyp verb `which` failed at /tmp/d20181026-47-123vy6y/opt/openproject/frontend/node_modules/isexe/index.js:42:5

gyp verb `which` failed at /tmp/d20181026-47-123vy6y/opt/openproject/frontend/node_modules/isexe/mode.js:8:5

gyp verb `which` failed at FSReqCallback.oncomplete (fs.js:161:21)

gyp verb `which` failed stack:

gyp verb `which` failed 'Error: not found: python2n at getNotFoundError (/tmp/d20181026-47-123vy6y/opt/openproject/frontend/node_modules/which/which.js:13:12)n at F (/tmp/d20181026-47-123vy6y/opt/openproject/frontend/node_modules/which/which.js:68:19)n at E (/tmp/d20181026-47-123vy6y/opt/openproject/frontend/node_modules/which/which.js:80:29)n at /tmp/d20181026-47-123vy6y/opt/openproject/frontend/node_modules/which/which.js:89:16n at /tmp/d20181026-47-123vy6y/opt/openproject/frontend/node_modules/isexe/index.js:42:5n at /tmp/d20181026-47-123vy6y/opt/openproject/frontend/node_modules/isexe/mode.js:8:5n at FSReqCallback.oncomplete (fs.js:161:21)',

gyp verb `which` failed code: 'ENOENT' }

gyp verb check python checking for Python executable "python" in the PATH

gyp verb `which` failed Error: not found: python

gyp verb `which` failed at getNotFoundError (/tmp/d20181026-47-123vy6y/opt/openproject/frontend/node_modules/which/which.js:13:12)

gyp verb `which` failed at F (/tmp/d20181026-47-123vy6y/opt/openproject/frontend/node_modules/which/which.js:68:19)

gyp verb `which` failed at E (/tmp/d20181026-47-123vy6y/opt/openproject/frontend/node_modules/which/which.js:80:29)

gyp verb `which` failed at /tmp/d20181026-47-123vy6y/opt/openproject/frontend/node_modules/which/which.js:89:16

gyp verb `which` failed at /tmp/d20181026-47-123vy6y/opt/openproject/frontend/node_modules/isexe/index.js:42:5

gyp verb `which` failed at /tmp/d20181026-47-123vy6y/opt/openproject/frontend/node_modules/isexe/mode.js:8:5

gyp verb `which` failed at FSReqCallback.oncomplete (fs.js:161:21)

gyp verb `which` failed python { Error: not found: python

gyp verb `which` failed at getNotFoundError (/tmp/d20181026-47-123vy6y/opt/openproject/frontend/node_modules/which/which.js:13:12)

gyp verb `which` failed at F (/tmp/d20181026-47-123vy6y/opt/openproject/frontend/node_modules/which/which.js:68:19)

gyp verb `which` failed at E (/tmp/d20181026-47-123vy6y/opt/openproject/frontend/node_modules/which/which.js:80:29)

gyp verb `which` failed at /tmp/d20181026-47-123vy6y/opt/openproject/frontend/node_modules/which/which.js:89:16

gyp verb `which` failed at /tmp/d20181026-47-123vy6y/opt/openproject/frontend/node_modules/isexe/index.js:42:5

gyp verb `which` failed at /tmp/d20181026-47-123vy6y/opt/openproject/frontend/node_modules/isexe/mode.js:8:5

gyp verb `which` failed at FSReqCallback.oncomplete (fs.js:161:21)

gyp verb `which` failed stack:

gyp verb `which` failed 'Error: not found: pythonn at getNotFoundError (/tmp/d20181026-47-123vy6y/opt/openproject/frontend/node_modules/which/which.js:13:12)n at F (/tmp/d20181026-47-123vy6y/opt/openproject/frontend/node_modules/which/which.js:68:19)n at E (/tmp/d20181026-47-123vy6y/opt/openproject/frontend/node_modules/which/which.js:80:29)n at /tmp/d20181026-47-123vy6y/opt/openproject/frontend/node_modules/which/which.js:89:16n at /tmp/d20181026-47-123vy6y/opt/openproject/frontend/node_modules/isexe/index.js:42:5n at /tmp/d20181026-47-123vy6y/opt/openproject/frontend/node_modules/isexe/mode.js:8:5n at FSReqCallback.oncomplete (fs.js:161:21)',

gyp verb `which` failed code: 'ENOENT' }

gyp ERR! configure error

gyp ERR! stack Error: Can't find Python executable "python", you can set the PYTHON env variable.

gyp ERR! stack at PythonFinder.failNoPython (/tmp/d20181026-47-123vy6y/opt/openproject/frontend/node_modules/node-gyp/lib/configure.js:484:19)

gyp ERR! stack at PythonFinder.<anonymous> (/tmp/d20181026-47-123vy6y/opt/openproject/frontend/node_modules/node-gyp/lib/configure.js:406:16)

gyp ERR! stack at F (/tmp/d20181026-47-123vy6y/opt/openproject/frontend/node_modules/which/which.js:68:16)

gyp ERR! stack at E (/tmp/d20181026-47-123vy6y/opt/openproject/frontend/node_modules/which/which.js:80:29)

gyp ERR! stack at /tmp/d20181026-47-123vy6y/opt/openproject/frontend/node_modules/which/which.js:89:16

gyp ERR! stack at /tmp/d20181026-47-123vy6y/opt/openproject/frontend/node_modules/isexe/index.js:42:5

gyp ERR! stack at /tmp/d20181026-47-123vy6y/opt/openproject/frontend/node_modules/isexe/mode.js:8:5

gyp ERR! stack at FSReqCallback.oncomplete (fs.js:161:21)

gyp ERR! System Linux 4.9.120-xxxx-std-ipv6-64

gyp ERR! command "/tmp/d20181026-47-123vy6y/opt/openproject/.heroku/node/bin/node" "/tmp/d20181026-47-123vy6y/opt/openproject/frontend/node_modules/node-gyp/bin/node-gyp.js" "rebuild" "--verbose" "--libsass_ext=" "--libsass_cflags=" "--libsass_ldflags=" "--libsass_library="

gyp ERR! cwd /tmp/d20181026-47-123vy6y/opt/openproject/frontend/node_modules/node-sass

gyp ERR! node -v v11.0.0

gyp ERR! node-gyp -v v3.8.0

gyp ERR! not ok

Build failed with error code: 1

npm ERR! code ELIFECYCLE

npm ERR! errno 1

npm ERR! node-sass@4.9.3 postinstall: `node scripts/build.js`

npm ERR! Exit status 1

npm ERR!

npm ERR! Failed at the node-sass@4.9.3 postinstall script.

npm ERR! This is probably not a problem with npm. There is likely additional logging output above.

npm ERR! A complete log of this run can be found in:

npm ERR! /home/pkgr/.npm/_logs/2018-10-26T12_00_50_460Z-debug.log

npm ERR! code ELIFECYCLE

npm ERR! errno 1

npm ERR! openproject@0.1.0 postinstall: `cd frontend && npm install`

npm ERR! Exit status 1

npm ERR!

npm ERR! Failed at the openproject@0.1.0 postinstall script.

npm ERR! This is probably not a problem with npm. There is likely additional logging output above.

npm ERR! A complete log of this run can be found in:

npm ERR! /home/pkgr/.npm/_logs/2018-10-26T12_00_50_705Z-debug.log

-----> Build failed

We're sorry this build is failing! You can troubleshoot common issues here:

https://devcenter.heroku.com/articles/troubleshooting-node-deploys

Some possible problems:

- Dangerous semver range (>) in engines.node

https://devcenter.heroku.com/articles/nodejs-support#specifying-a-node-js-version

Love,

Heroku

! ERROR: compile failed

Failed to package application

tar: This does not look like a tar archive

tar: Exiting with failure status due to previous errors

! FAILED - Build error.

! Please contact support.

====== Attempt #3

-----> Fetching repository

Cloning into '/tmp/d20181026-11-luc0z8/input'...

-----> Setting up package repository...

-----> Starting packaging process

-----> Starting service postgres...

-----> Additional environment variables

UUID=f7b403e5-6abf-4130-98c5-26202236f10f

DATABASE_URL=postgres://postgres:lDqi49Rt4RK1TR0W@8.26.94.84:32794/postgres

DATABASE_HOST=8.26.94.84

DATABASE_PORT=32794

HOME=/home/pkgr

-----> Empty or invalid cache

-----> Fetching pkgr 6802d07ced92047cb5ed20b9ff79f204cc423bac...

-----> Starting packaging process...

-----> Installing missing build dependencies: libsqlite3-dev

-----> [wizard] adding legacy-installer wizard (https://github.com/pkgr/addon-legacy-installer#master)

-----> [wizard] adding mysql wizard (https://github.com/pkgr/addon-mysql#master)

-----> [wizard] adding apache2 wizard (https://github.com/pkgr/addon-apache2#master)

-----> [wizard] adding repositories wizard (https://github.com/finnlabs/addon-repositories#master)

-----> [wizard] adding smtp wizard (https://github.com/pkgr/addon-smtp#master)

-----> [wizard] adding memcached wizard (https://github.com/pkgr/addon-memcached#master)

-----> [wizard] adding openproject wizard (https://github.com/pkgr/addon-openproject#master)

-----> Fetching buildpack https://github.com/opf/heroku-buildpack-multi.git at master

-----> Running hook: "packaging/setup"

-----> Multipack app

WARNING: This buildpack is no longer maintained.

Please choose a different buildpack or go to https://github.com/ddollar/heroku-buildpack-multi

and fork it to your own account.

=====> Downloading Buildpack: https://github.com/pkgr/pkgr-buildpack-imagemagick.git

=====> Detected Framework: ImageMagick

-----> SKIP

=====> Downloading Buildpack: https://github.com/heroku/heroku-buildpack-nodejs.git

=====> Detected Framework: Node.js

-----> Creating runtime environment

NPM_CONFIG_LOGLEVEL=error

NPM_CONFIG_PRODUCTION=true

NODE_ENV=production

NODE_MODULES_CACHE=true

NODE_VERBOSE=false

-----> Installing binaries

engines.node (package.json): >= 6.9.1

engines.npm (package.json): >= 4.0.0

Resolving node version >= 6.9.1 via semver.io...

Downloading and installing node 11.0.0...

Resolving npm version >= 4.0.0 via semver.io...

npm 6.4.1 already installed with node

-----> Restoring cache

Skipping cache restore (new-signature)

-----> Building dependencies

Installing node modules (package.json)

> openproject@0.1.0 postinstall /tmp/d20181026-47-u9b37z/opt/openproject

> cd frontend && npm install

> @uirouter/core@5.0.17 install /tmp/d20181026-47-u9b37z/opt/openproject/frontend/node_modules/@uirouter/core

> node migrate/migratewarn.js

> node-sass@4.9.3 install /tmp/d20181026-47-u9b37z/opt/openproject/frontend/node_modules/node-sass

> node scripts/install.js

Downloading binary from https://github.com/sass/node-sass/releases/download/v4.9.3/linux-x64-67_binding.node

Cannot download "https://github.com/sass/node-sass/releases/download/v4.9.3/linux-x64-67_binding.node":

HTTP error 404 Not Found

Hint: If github.com is not accessible in your location

try setting a proxy via HTTP_PROXY, e.g.

export HTTP_PROXY=http://example.com:1234

or configure npm proxy via

npm config set proxy http://example.com:8080

> node-sass@4.9.3 postinstall /tmp/d20181026-47-u9b37z/opt/openproject/frontend/node_modules/node-sass

> node scripts/build.js

Building: /tmp/d20181026-47-u9b37z/opt/openproject/.heroku/node/bin/node /tmp/d20181026-47-u9b37z/opt/openproject/frontend/node_modules/node-gyp/bin/node-gyp.js rebuild --verbose --libsass_ext= --libsass_cflags= --libsass_ldflags= --libsass_library=

gyp info it worked if it ends with ok

gyp verb cli [ '/tmp/d20181026-47-u9b37z/opt/openproject/.heroku/node/bin/node',

gyp verb cli '/tmp/d20181026-47-u9b37z/opt/openproject/frontend/node_modules/node-gyp/bin/node-gyp.js',

gyp verb cli 'rebuild',

gyp verb cli '--verbose',

gyp verb cli '--libsass_ext=',

gyp verb cli '--libsass_cflags=',

gyp verb cli '--libsass_ldflags=',

gyp verb cli '--libsass_library=' ]

gyp info using node-gyp@3.8.0

gyp info using node@11.0.0 | linux | x64

gyp verb command rebuild []

gyp verb command clean []

gyp verb clean removing "build" directory

gyp verb command configure []

gyp verb check python checking for Python executable "python2" in the PATH

gyp verb `which` failed Error: not found: python2

gyp verb `which` failed at getNotFoundError (/tmp/d20181026-47-u9b37z/opt/openproject/frontend/node_modules/which/which.js:13:12)

gyp verb `which` failed at F (/tmp/d20181026-47-u9b37z/opt/openproject/frontend/node_modules/which/which.js:68:19)

gyp verb `which` failed at E (/tmp/d20181026-47-u9b37z/opt/openproject/frontend/node_modules/which/which.js:80:29)

gyp verb `which` failed at /tmp/d20181026-47-u9b37z/opt/openproject/frontend/node_modules/which/which.js:89:16

gyp verb `which` failed at /tmp/d20181026-47-u9b37z/opt/openproject/frontend/node_modules/isexe/index.js:42:5

gyp verb `which` failed at /tmp/d20181026-47-u9b37z/opt/openproject/frontend/node_modules/isexe/mode.js:8:5

gyp verb `which` failed at FSReqCallback.oncomplete (fs.js:161:21)

gyp verb `which` failed python2 { Error: not found: python2

gyp verb `which` failed at getNotFoundError (/tmp/d20181026-47-u9b37z/opt/openproject/frontend/node_modules/which/which.js:13:12)

gyp verb `which` failed at F (/tmp/d20181026-47-u9b37z/opt/openproject/frontend/node_modules/which/which.js:68:19)

gyp verb `which` failed at E (/tmp/d20181026-47-u9b37z/opt/openproject/frontend/node_modules/which/which.js:80:29)

gyp verb `which` failed at /tmp/d20181026-47-u9b37z/opt/openproject/frontend/node_modules/which/which.js:89:16

gyp verb `which` failed at /tmp/d20181026-47-u9b37z/opt/openproject/frontend/node_modules/isexe/index.js:42:5

gyp verb `which` failed at /tmp/d20181026-47-u9b37z/opt/openproject/frontend/node_modules/isexe/mode.js:8:5

gyp verb `which` failed at FSReqCallback.oncomplete (fs.js:161:21)

gyp verb `which` failed stack:

gyp verb `which` failed 'Error: not found: python2n at getNotFoundError (/tmp/d20181026-47-u9b37z/opt/openproject/frontend/node_modules/which/which.js:13:12)n at F (/tmp/d20181026-47-u9b37z/opt/openproject/frontend/node_modules/which/which.js:68:19)n at E (/tmp/d20181026-47-u9b37z/opt/openproject/frontend/node_modules/which/which.js:80:29)n at /tmp/d20181026-47-u9b37z/opt/openproject/frontend/node_modules/which/which.js:89:16n at /tmp/d20181026-47-u9b37z/opt/openproject/frontend/node_modules/isexe/index.js:42:5n at /tmp/d20181026-47-u9b37z/opt/openproject/frontend/node_modules/isexe/mode.js:8:5n at FSReqCallback.oncomplete (fs.js:161:21)',

gyp verb `which` failed code: 'ENOENT' }

gyp verb check python checking for Python executable "python" in the PATH

gyp verb `which` failed Error: not found: python

gyp verb `which` failed at getNotFoundError (/tmp/d20181026-47-u9b37z/opt/openproject/frontend/node_modules/which/which.js:13:12)

gyp verb `which` failed at F (/tmp/d20181026-47-u9b37z/opt/openproject/frontend/node_modules/which/which.js:68:19)

gyp verb `which` failed at E (/tmp/d20181026-47-u9b37z/opt/openproject/frontend/node_modules/which/which.js:80:29)

gyp verb `which` failed at /tmp/d20181026-47-u9b37z/opt/openproject/frontend/node_modules/which/which.js:89:16

gyp verb `which` failed at /tmp/d20181026-47-u9b37z/opt/openproject/frontend/node_modules/isexe/index.js:42:5

gyp verb `which` failed at /tmp/d20181026-47-u9b37z/opt/openproject/frontend/node_modules/isexe/mode.js:8:5

gyp verb `which` failed at FSReqCallback.oncomplete (fs.js:161:21)

gyp verb `which` failed python { Error: not found: python

gyp verb `which` failed at getNotFoundError (/tmp/d20181026-47-u9b37z/opt/openproject/frontend/node_modules/which/which.js:13:12)

gyp verb `which` failed at F (/tmp/d20181026-47-u9b37z/opt/openproject/frontend/node_modules/which/which.js:68:19)

gyp verb `which` failed at E (/tmp/d20181026-47-u9b37z/opt/openproject/frontend/node_modules/which/which.js:80:29)

gyp verb `which` failed at /tmp/d20181026-47-u9b37z/opt/openproject/frontend/node_modules/which/which.js:89:16

gyp verb `which` failed at /tmp/d20181026-47-u9b37z/opt/openproject/frontend/node_modules/isexe/index.js:42:5

gyp verb `which` failed at /tmp/d20181026-47-u9b37z/opt/openproject/frontend/node_modules/isexe/mode.js:8:5

gyp verb `which` failed at FSReqCallback.oncomplete (fs.js:161:21)

gyp verb `which` failed stack:

gyp verb `which` failed 'Error: not found: pythonn at getNotFoundError (/tmp/d20181026-47-u9b37z/opt/openproject/frontend/node_modules/which/which.js:13:12)n at F (/tmp/d20181026-47-u9b37z/opt/openproject/frontend/node_modules/which/which.js:68:19)n at E (/tmp/d20181026-47-u9b37z/opt/openproject/frontend/node_modules/which/which.js:80:29)n at /tmp/d20181026-47-u9b37z/opt/openproject/frontend/node_modules/which/which.js:89:16n at /tmp/d20181026-47-u9b37z/opt/openproject/frontend/node_modules/isexe/index.js:42:5n at /tmp/d20181026-47-u9b37z/opt/openproject/frontend/node_modules/isexe/mode.js:8:5n at FSReqCallback.oncomplete (fs.js:161:21)',

gyp verb `which` failed code: 'ENOENT' }

gyp ERR! configure error

gyp ERR! stack Error: Can't find Python executable "python", you can set the PYTHON env variable.

gyp ERR! stack at PythonFinder.failNoPython (/tmp/d20181026-47-u9b37z/opt/openproject/frontend/node_modules/node-gyp/lib/configure.js:484:19)

gyp ERR! stack at PythonFinder.<anonymous> (/tmp/d20181026-47-u9b37z/opt/openproject/frontend/node_modules/node-gyp/lib/configure.js:406:16)

gyp ERR! stack at F (/tmp/d20181026-47-u9b37z/opt/openproject/frontend/node_modules/which/which.js:68:16)

gyp ERR! stack at E (/tmp/d20181026-47-u9b37z/opt/openproject/frontend/node_modules/which/which.js:80:29)

gyp ERR! stack at /tmp/d20181026-47-u9b37z/opt/openproject/frontend/node_modules/which/which.js:89:16

gyp ERR! stack at /tmp/d20181026-47-u9b37z/opt/openproject/frontend/node_modules/isexe/index.js:42:5

gyp ERR! stack at /tmp/d20181026-47-u9b37z/opt/openproject/frontend/node_modules/isexe/mode.js:8:5

gyp ERR! stack at FSReqCallback.oncomplete (fs.js:161:21)

gyp ERR! System Linux 4.9.120-xxxx-std-ipv6-64

gyp ERR! command "/tmp/d20181026-47-u9b37z/opt/openproject/.heroku/node/bin/node" "/tmp/d20181026-47-u9b37z/opt/openproject/frontend/node_modules/node-gyp/bin/node-gyp.js" "rebuild" "--verbose" "--libsass_ext=" "--libsass_cflags=" "--libsass_ldflags=" "--libsass_library="

gyp ERR! cwd /tmp/d20181026-47-u9b37z/opt/openproject/frontend/node_modules/node-sass

gyp ERR! node -v v11.0.0

gyp ERR! node-gyp -v v3.8.0

gyp ERR! not ok

Build failed with error code: 1

npm ERR! code ELIFECYCLE

npm ERR! errno 1

npm ERR! node-sass@4.9.3 postinstall: `node scripts/build.js`

npm ERR! Exit status 1

npm ERR!

npm ERR! Failed at the node-sass@4.9.3 postinstall script.

npm ERR! This is probably not a problem with npm. There is likely additional logging output above.

npm ERR! A complete log of this run can be found in:

npm ERR! /home/pkgr/.npm/_logs/2018-10-26T12_08_14_098Z-debug.log

npm ERR! code ELIFECYCLE

npm ERR! errno 1

npm ERR! openproject@0.1.0 postinstall: `cd frontend && npm install`

npm ERR! Exit status 1

npm ERR!

npm ERR! Failed at the openproject@0.1.0 postinstall script.

npm ERR! This is probably not a problem with npm. There is likely additional logging output above.

npm ERR! A complete log of this run can be found in:

npm ERR! /home/pkgr/.npm/_logs/2018-10-26T12_08_14_328Z-debug.log

-----> Build failed

We're sorry this build is failing! You can troubleshoot common issues here:

https://devcenter.heroku.com/articles/troubleshooting-node-deploys

Some possible problems:

- Dangerous semver range (>) in engines.node

https://devcenter.heroku.com/articles/nodejs-support#specifying-a-node-js-version

Love,

Heroku

! ERROR: compile failed

Failed to package application

tar: This does not look like a tar archive

tar: Exiting with failure status due to previous errors

! FAILED - Build error.

! Please contact support.