Debian 11 Bullseye 64bits

Logs

====== Attempt #1

-----> Fetching repository

Cloning into '/tmp/d20211122-6-uwuhjm/input'...

Checking out files: 31% (3515/11149) Checking out files: 32% (3568/11149) Checking out files: 33% (3680/11149) Checking out files: 34% (3791/11149) Checking out files: 35% (3903/11149) Checking out files: 36% (4014/11149) Checking out files: 37% (4126/11149) Checking out files: 38% (4237/11149) Checking out files: 39% (4349/11149) Checking out files: 40% (4460/11149) Checking out files: 41% (4572/11149) Checking out files: 42% (4683/11149) Checking out files: 43% (4795/11149) Checking out files: 44% (4906/11149) Checking out files: 45% (5018/11149) Checking out files: 46% (5129/11149) Checking out files: 47% (5241/11149) Checking out files: 48% (5352/11149) Checking out files: 49% (5464/11149) Checking out files: 50% (5575/11149) Checking out files: 51% (5686/11149) Checking out files: 52% (5798/11149) Checking out files: 53% (5909/11149) Checking out files: 54% (6021/11149) Checking out files: 55% (6132/11149) Checking out files: 56% (6244/11149) Checking out files: 57% (6355/11149) Checking out files: 58% (6467/11149) Checking out files: 59% (6578/11149) Checking out files: 60% (6690/11149) Checking out files: 61% (6801/11149) Checking out files: 62% (6913/11149) Checking out files: 63% (7024/11149) Checking out files: 64% (7136/11149) Checking out files: 65% (7247/11149) Checking out files: 66% (7359/11149) Checking out files: 67% (7470/11149) Checking out files: 68% (7582/11149) Checking out files: 69% (7693/11149) Checking out files: 70% (7805/11149) Checking out files: 71% (7916/11149) Checking out files: 72% (8028/11149) Checking out files: 73% (8139/11149) Checking out files: 74% (8251/11149) Checking out files: 75% (8362/11149) Checking out files: 76% (8474/11149) Checking out files: 77% (8585/11149) Checking out files: 78% (8697/11149) Checking out files: 79% (8808/11149) Checking out files: 80% (8920/11149) Checking out files: 81% (9031/11149) Checking out files: 82% (9143/11149) Checking out files: 83% (9254/11149) Checking out files: 84% (9366/11149) Checking out files: 85% (9477/11149) Checking out files: 86% (9589/11149) Checking out files: 87% (9700/11149) Checking out files: 88% (9812/11149) Checking out files: 89% (9923/11149) Checking out files: 90% (10035/11149) Checking out files: 91% (10146/11149) Checking out files: 92% (10258/11149) Checking out files: 93% (10369/11149) Checking out files: 94% (10481/11149) Checking out files: 95% (10592/11149) Checking out files: 96% (10704/11149) Checking out files: 97% (10815/11149) Checking out files: 98% (10927/11149) Checking out files: 99% (11038/11149) Checking out files: 100% (11149/11149) Checking out files: 100% (11149/11149), done.

-----> Setting up package repository...

-----> Starting packaging process

-----> Starting service postgres...

-----> Additional environment variables

UUID=65eafff6-6ec6-4bd7-a921-d6b78359f5cb

DATABASE_URL=postgres://postgres:_y5i_aFiZo9Ir6Az@164.132.201.42:52720/postgres

DATABASE_HOST=164.132.201.42

DATABASE_PORT=52720

HOME=/home/pkgr

-----> Found valid cache

-----> Restoring cache...

-----> Fetching pkgr a814586c359bb9639023b5d09bf75ada4b949796...

-----> Starting packaging process...

-----> Installing missing build dependencies: libsqlite3-dev

-----> [wizard] adding legacy-installer wizard (https://github.com/pkgr/addon-legacy-installer#master)

-----> [wizard] adding openproject-edition wizard (/tmp/d20211122-58-13lcvdf/opt/openproject/packaging/addons/openproject-edition#)

-----> [wizard] adding postgres wizard (https://github.com/pkgr/addon-postgres#master)

-----> [wizard] adding apache2 wizard (https://github.com/pkgr/addon-apache2#master)

-----> [wizard] adding repositories wizard (/tmp/d20211122-58-13lcvdf/opt/openproject/packaging/addons/repositories#)

-----> [wizard] adding smtp wizard (https://github.com/pkgr/addon-smtp#master)

-----> [wizard] adding memcached wizard (https://github.com/pkgr/addon-memcached#master)

-----> [wizard] adding openproject wizard (/tmp/d20211122-58-13lcvdf/opt/openproject/packaging/addons/openproject#)

-----> Fetching buildpack https://github.com/opf/heroku-buildpack-multi.git at master

-----> Running hook: "packaging/setup"

-----> Multipack app

=====> Downloading Buildpack: https://github.com/heroku/heroku-buildpack-nodejs.git

=====> Detected Framework: Node.js

-----> Creating runtime environment

NPM_CONFIG_PRODUCTION=false

NPM_CONFIG_LOGLEVEL=error

NODE_VERBOSE=false

NODE_ENV=production

NODE_MODULES_CACHE=true

-----> Installing binaries

engines.node (package.json): ~14.17.0

engines.npm (package.json): ~6.14.13

Resolving node version ~14.17.0...

Downloading and installing node 14.17.6...

Bootstrapping npm ~6.14.13 (replacing 6.14.15)...

npm ~6.14.13 installed

-----> Restoring cache

- node_modules

-----> Installing dependencies

Installing node modules (package.json)

> openproject@0.1.0 postinstall /tmp/d20211122-58-13lcvdf/opt/openproject

> cd frontend && npm install

> nice-napi@1.0.2 install /tmp/d20211122-58-13lcvdf/opt/openproject/frontend/node_modules/nice-napi

> node-gyp-build

> core-js@2.6.12 postinstall /tmp/d20211122-58-13lcvdf/opt/openproject/frontend/node_modules/babel-runtime/node_modules/core-js

> node -e "try{require('./postinstall')}catch(e){}"

> core-js@3.16.0 postinstall /tmp/d20211122-58-13lcvdf/opt/openproject/frontend/node_modules/core-js

> node -e "try{require('./postinstall')}catch(e){}"

> core-js-pure@3.9.1 postinstall /tmp/d20211122-58-13lcvdf/opt/openproject/frontend/node_modules/core-js-pure

> node -e "try{require('./postinstall')}catch(e){}"

> esbuild@0.12.24 postinstall /tmp/d20211122-58-13lcvdf/opt/openproject/frontend/node_modules/esbuild

> node install.js

> core-js-pure@3.15.2 postinstall /tmp/d20211122-58-13lcvdf/opt/openproject/frontend/node_modules/swagger-ui/node_modules/core-js-pure

> node -e "try{require('./postinstall')}catch(e){}"

> @angular/cli@12.2.6 postinstall /tmp/d20211122-58-13lcvdf/opt/openproject/frontend/node_modules/@angular/cli

> node ./bin/postinstall/script.js

added 2075 packages from 2626 contributors in 189.035s

172 packages are looking for funding

run `npm fund` for details

up to date in 195.185s

2 packages are looking for funding

run `npm fund` for details

-----> Build

-----> Pruning devDependencies

Skipping because NPM_CONFIG_PRODUCTION is 'false'

-----> Caching build

- node_modules

-----> Build succeeded!

=====> Downloading Buildpack: https://github.com/pkgr/heroku-buildpack-ruby.git

=====> Detected Framework: Ruby

-----> Installing bundler 2.0.2

-----> Removing BUNDLED WITH version in the Gemfile.lock

-----> Compiling Ruby/Rails

-----> Using Ruby version: ruby-2.7.4

cp: '/my/cache/vendor/bundle/.' and '/my/cache/vendor/bundle/.' are the same file

-----> Installing dependencies using bundler 2.0.2

Running: bundle install --without development:test --path vendor/bundle --binstubs vendor/bundle/bin -j4 --deployment

[DEPRECATED] The `--deployment` flag is deprecated because it relies on being remembered across bundler invocations, which bundler will no longer do in future versions. Instead please use `bundle config set deployment 'true'`, and stop using this flag

[DEPRECATED] The `--path` flag is deprecated because it relies on being remembered across bundler invocations, which bundler will no longer do in future versions. Instead please use `bundle config set path 'vendor/bundle'`, and stop using this flag

[DEPRECATED] The `--without` flag is deprecated because it relies on being remembered across bundler invocations, which bundler will no longer do in future versions. Instead please use `bundle config set without 'development:test'`, and stop using this flag

[DEPRECATED] The --binstubs option will be removed in favor of `bundle binstubs`

Using rake 13.0.6

Using Ascii85 1.1.0

Using concurrent-ruby 1.1.9

Using i18n 1.8.11

Using minitest 5.14.4

Using tzinfo 2.0.4

Using zeitwerk 2.5.1

Using activesupport 6.1.4.1

Using builder 3.2.4

Using erubi 1.10.0

Using mini_portile2 2.6.1

Using racc 1.6.0

Using nokogiri 1.12.5 (x86_64-linux)

Using rails-dom-testing 2.0.3

Using crass 1.0.6

Using loofah 2.12.0

Using rails-html-sanitizer 1.4.2

Using actionview 6.1.4.1

Using rack 2.2.3

Using rack-test 1.1.0

Using actionpack 6.1.4.1

Using nio4r 2.5.8

Using websocket-extensions 0.1.5

Using websocket-driver 0.7.5

Using actioncable 6.1.4.1

Using globalid 0.5.2

Using activejob 6.1.4.1

Using activemodel 6.1.4.1

Using activerecord 6.1.4.1

Using marcel 1.0.2

Using mini_mime 1.1.2

Using activestorage 6.1.4.1

Using mail 2.7.1

Using actionmailbox 6.1.4.1

Using actionmailer 6.1.4.1

Using method_source 1.0.0

Using thor 1.1.0

Using railties 6.1.4.1

Using actionpack-xml_parser 2.0.1

Using actiontext 6.1.4.1

Using activemodel-serializers-xml 1.0.2

Using activerecord-import 1.2.0

Using activerecord-nulldb-adapter 0.8.0

Using multi_json 1.15.0

Using activerecord-session_store 2.0.0

Using acts_as_list 1.0.4

Using acts_as_tree 2.9.1

Using public_suffix 4.0.6

Using addressable 2.8.0

Using aes_key_wrap 1.1.0

Using afm 0.2.2

Using rbtree3 0.6.0

Using airbrake-ruby 6.0.1

Using airbrake 12.0.0

Using attr_required 1.0.1

Using auto_strip_attributes 2.6.0

Using awesome_nested_set 3.4.0

Using aws-eventstream 1.2.0

Using aws-partitions 1.532.0

Using aws-sigv4 1.4.0

Using jmespath 1.4.0

Using aws-sdk-core 3.122.1

Using aws-sdk-kms 1.51.0

Using aws-sdk-s3 1.106.0

Using aws-sdk-sns 1.48.0

Using bcrypt 3.1.16

Using bindata 2.4.10

Using msgpack 1.4.2

Using bootsnap 1.9.1

Using browser 5.3.1

Using budgets 1.0.0 from source at `modules/budgets`

Using bundler 2.1.4

Using mime-types-data 3.2021.1115

Using mime-types 3.4.1

Using ssrf_filter 1.0.7

Using carrierwave 1.3.2

Using excon 0.88.0

Using formatador 0.3.0

Using fog-core 2.2.4

Using fog-json 1.2.0

Using fog-xml 0.1.4

Using ipaddress 0.8.3

Using fog-aws 3.12.0

Using carrierwave_direct 2.1.0

Using declarative-option 0.1.0

Using declarative-builder 0.1.0

Using tilt 2.0.10

Using uber 0.1.0

Using cells 4.1.7

Using temple 0.8.2

Using erbse 0.1.4

Using cells-erb 0.1.0

Using cells-rails 0.1.4

Using commonmarker 0.23.2

Using costs 1.0.0 from source at `modules/costs`

Using http-accept 1.7.0

Using unf_ext 0.0.8

Using unf 0.1.4

Using domain_name 0.5.20190701

Using http-cookie 1.0.4

Using netrc 0.11.0

Using rest-client 2.1.0

Using crowdin-api 0.6.0

Using daemons 1.4.1

Using dalli 3.0.4

Using grids 1.0.0 from source at `modules/grids`

Using dashboards 1.0.0 from source at `modules/dashboards`

Using date_validator 0.12.0

Using html-pipeline 2.14.0

Using deckar01-task_list 2.3.2

Using declarative 0.0.20

Using et-orbi 1.2.6

Using raabro 1.4.0

Using fugit 1.5.2

Using delayed_cron_job 0.9.0

Using delayed_job 4.1.9

Using delayed_job_active_record 4.1.6

Using trailblazer-option 0.1.2

Using representable 3.1.0

Using disposable 0.4.7

Using doorkeeper 5.5.4

Using dry-core 0.7.1

Using dry-configurable 0.13.0

Using dry-container 0.9.0

Using dry-inflector 0.2.1

Using dry-logic 1.2.0

Using dry-types 1.5.1

Using regexp_parser 2.1.1

Using ecma-re-validator 0.3.0

Using email_validator 2.2.3

Using escape_utils 1.2.1

Using faraday-em_http 1.0.0

Using faraday-em_synchrony 1.0.0

Using faraday-excon 1.1.0

Using faraday-httpclient 1.0.1

Using faraday-net_http 1.0.1

Using faraday-net_http_persistent 1.2.0

Using faraday-patron 1.0.0

Using faraday-rack 1.0.0

Using multipart-post 2.1.1

Using ruby2_keywords 0.0.5

Using faraday 1.8.0

Using fastimage 2.2.5

Using ffi 1.15.4

Using friendly_id 5.4.2

Using request_store 1.5.0

Using gon 6.4.0

Using mustermann 1.1.1

Using mustermann-grape 1.0.1

Using rack-accept 0.4.5

Using grape 1.6.0

Using grape_logging 1.8.4

Using gravatar_image_tag 1.2.0

Using hana 1.3.7

Using hashery 2.1.2

Using hashie 3.6.0

Using htmldiff 0.0.1

Using httpclient 2.8.3

Using i18n-js 3.9.0

Using ice_cube 0.16.4

Using icalendar 2.7.1

Using iso8601 0.13.0

Using json 2.6.1

Using json-jwt 1.13.0

Using uri_template 0.7.0

Using json_schemer 0.2.18

Using omniauth 1.9.0 from https://github.com/opf/omniauth (at fe862f9@fe862f9)

Using rack-oauth2 1.19.0

Using swd 1.3.0

Using validate_email 0.1.6

Using validate_url 1.0.13

Using webfinger 1.2.0

Using openid_connect 1.1.8

Using omniauth-openid-connect 0.4.0 from https://github.com/opf/omniauth-openid-connect.git (at e1173e6@e1173e6)

Using sprockets 3.7.2

Using sprockets-rails 3.4.0

Using rails 6.1.4.1

Using lobby_boy 0.1.3

Using lograge 0.11.2

Using messagebird-rest 1.4.2

Using meta-tags 2.16.0

Using mini_magick 4.11.0

Using mixlib-shellout 2.1.0

Using my_page 1.0.0 from source at `modules/my_page`

Using net-ldap 0.17.0

Using oj 3.13.9

Using okcomputer 1.18.4

Using omniauth-openid_connect-providers 0.2.0 from https://github.com/opf/omniauth-openid_connect-providers.git (at a6c0c3e@a6c0c3e)

Using rexml 3.2.5

Using ruby-saml 1.13.0

Using omniauth-saml 1.10.3

Using openproject-auth_plugins 1.0.0 from source at `modules/auth_plugins`

Using openproject-auth_saml 1.0.0 from source at `modules/auth_saml`

Using openproject-avatars 1.0.0 from source at `modules/avatars`

Using ruby-rc4 0.1.5

Using ttfunk 1.7.0

Using pdf-reader 2.6.0

Using pdf-inspector 1.3.0

Using pdf-core 0.9.0

Using prawn 2.4.0

Using openproject-pdf_export 1.0.0 from source at `modules/pdf_export`

Using openproject-backlogs 1.0.0 from source at `modules/backlogs`

Using rubyzip 2.3.2

Using openproject-bim 1.0.0 from source at `modules/bim`

Using openproject-boards 1.0.0 from source at `modules/boards`

Using openproject-documents 1.0.0 from source at `modules/documents`

Using openproject-webhooks 1.0.0 from source at `modules/webhooks`

Using openproject-github_integration 1.0.0 from source at `modules/github_integration`

Using openproject-job_status 1.0.0 from source at `modules/job_status`

Using openproject-ldap_groups 1.0.0 from source at `modules/ldap_groups`

Using openproject-meeting 1.0.0 from source at `modules/meeting`

Using openproject-openid_connect 1.0.0 from source at `modules/openid_connect`

Using recaptcha 5.8.1

Using openproject-recaptcha 1.0.0 from source at `modules/recaptcha`

Using openproject-reporting 1.0.0 from source at `modules/reporting`

Using openproject-token 2.2.0

Using openproject-translations 7.4.0 from https://github.com/opf/openproject-translations.git (at dev@6ce2c62)

Using rotp 6.2.0

Using openproject-two_factor_authentication 1.0.0 from source at `modules/two_factor_authentication`

Using ruby-ole 1.2.12.2

Using spreadsheet 1.3.0

Using openproject-xls_export 1.0.0 from source at `modules/xls_export`

Using overviews 1.0.0 from source at `modules/overviews`

Using pg 1.2.3

Using plaintext 0.3.4

Using posix-spawn 0.3.15

Using prawn-table 0.2.2

Using prawn-markup 0.3.3

Using puma 5.5.2

Using puma-plugin-statsd 2.0.0

Using rack-attack 6.5.0

Using rack-cors 1.1.1

Using rack-protection 2.1.0

Using rack-timeout 0.6.0

Using rails-i18n 6.0.0

Using rdoc 6.3.3

Using responders 3.0.1

Using rinku 2.0.6

Using roar 1.1.1

Using rouge 3.26.1

Using ruby-duration 3.2.3

Using ruby-progressbar 1.11.0

Using structured_warnings 0.4.0

Using rubytree 1.0.0

Using sanitize 6.0.0

Using secure_headers 6.3.3

Using semantic 1.6.1

Using sentry-ruby-core 4.8.0

Using sentry-delayed_job 4.8.0

Using sentry-rails 4.8.0

Using sentry-ruby 4.8.0

Using stringex 2.8.5

Using svg-graph 2.2.1

Using sys-filesystem 1.4.3

Using typed_dag 2.0.2

Using tzinfo-data 1.2021.5

Using warden 1.2.9

Using warden-basic_auth 0.2.1

Using will_paginate 3.3.1

Using with_advisory_lock 4.6.0

Bundle complete! 166 Gemfile dependencies, 260 gems now installed.

Gems in the groups development and test were not installed.

Bundled gems are installed into `./vendor/bundle`

Removing bundler (2.0.2)

Bundle completed (3.29s)

Cleaning up the bundler cache.

-----> Detecting rake tasks

-----> Preparing app for Rails asset pipeline

Running: rake assets:precompile

npm run build

W, [2021-11-22T09:34:50.266279 #1819] WARN -- : 127.0.0.1:11211 failed (count: 0) Errno::ECONNREFUSED: Connection refused - connect(2) for "127.0.0.1" port 11211

W, [2021-11-22T09:34:50.422274 #1819] WARN -- : 127.0.0.1:11211 failed (count: 1) Errno::ECONNREFUSED: Connection refused - connect(2) for "127.0.0.1" port 11211

W, [2021-11-22T09:34:50.422355 #1819] WARN -- : 127.0.0.1:11211 is down

Linking frontend plugins

Cleaning linked target directory /tmp/d20211122-58-13lcvdf/opt/openproject/frontend/src/app/features/plugins/linked

Linking frontend of OpenProject plugin budgets to /tmp/d20211122-58-13lcvdf/opt/openproject/frontend/src/app/features/plugins/linked/budgets.

Linking frontend of OpenProject plugin costs to /tmp/d20211122-58-13lcvdf/opt/openproject/frontend/src/app/features/plugins/linked/costs.

Linking frontend of OpenProject plugin openproject-avatars to /tmp/d20211122-58-13lcvdf/opt/openproject/frontend/src/app/features/plugins/linked/openproject-avatars.

Linking frontend of OpenProject plugin openproject-documents to /tmp/d20211122-58-13lcvdf/opt/openproject/frontend/src/app/features/plugins/linked/openproject-documents.

Linking frontend of OpenProject plugin openproject-github_integration to /tmp/d20211122-58-13lcvdf/opt/openproject/frontend/src/app/features/plugins/linked/openproject-github_integration.

Regenerating frontend plugin registry /tmp/d20211122-58-13lcvdf/opt/openproject/frontend/src/app/features/plugins/linked-plugins.module.ts.

Regenerating frontend plugin sass /tmp/d20211122-58-13lcvdf/opt/openproject/frontend/src/app/features/plugins/linked-plugins.styles.sass.

Building angular frontend

> openproject-frontend@0.1.0 prebuild /tmp/d20211122-58-13lcvdf/opt/openproject/frontend

> ./scripts/link_plugin_placeholder.js

> openproject-frontend@0.1.0 build /tmp/d20211122-58-13lcvdf/opt/openproject/frontend

> node --max_old_space_size=4096 ./node_modules/@angular/cli/bin/ng build --configuration production --named-chunks --extract-css --source-map

Option "extractCss" is deprecated: Deprecated since version 11.0. No longer required to disable CSS extraction for HMR.

- Generating browser application bundles (phase: setup)...

Compiling @angular/cdk/keycodes : es2015 as esm2015

Compiling @angular/core : es2015 as esm2015

Compiling @uirouter/core : module as esm5

Compiling @datorama/akita : es2015 as esm2015

Compiling @angular/cdk/collections : es2015 as esm2015

Compiling @angular/cdk/observers : es2015 as esm2015

Compiling @ng-select/ng-option-highlight : es2015 as esm2015

Compiling @angular/common : es2015 as esm2015

Compiling ng2-dragula : es2015 as esm2015

Compiling @angular/cdk/platform : es2015 as esm2015

Compiling @angular/cdk/bidi : es2015 as esm2015

Compiling @angular/platform-browser : es2015 as esm2015

Compiling @angular/forms : es2015 as esm2015

Compiling @angular/cdk/a11y : es2015 as esm2015

Compiling @angular/cdk/scrolling : es2015 as esm2015

Compiling @angular/cdk/portal : es2015 as esm2015

Compiling @angular/common/http : es2015 as esm2015

Compiling @angular/cdk/drag-drop : es2015 as esm2015

Compiling @angular/cdk/table : es2015 as esm2015

Compiling ng-dynamic-component : es2015 as esm2015

Compiling @ng-select/ng-select : es2015 as esm2015

Compiling @uirouter/angular : es2015 as esm2015

Compiling @angular/cdk/text-field : es2015 as esm2015

Compiling @ngx-formly/core : es2015 as esm2015

Compiling @kolkov/ngx-gallery : es2015 as esm2015

Compiling @angular/cdk/overlay : es2015 as esm2015

Compiling @fullcalendar/angular : es2015 as esm2015

Compiling ng2-charts : es2015 as esm2015

Compiling @ngneat/content-loader : es2015 as esm2015

Compiling cdk-drag-scroll : es2015 as esm2015

Compiling @angular/platform-browser-dynamic : es2015 as esm2015

Compiling @angular/router : es2015 as esm2015

Killed

npm ERR! code ELIFECYCLE

npm ERR! errno 137

npm ERR! openproject-frontend@0.1.0 build: `node --max_old_space_size=4096 ./node_modules/@angular/cli/bin/ng build --configuration production --named-chunks --extract-css --source-map`

npm ERR! Exit status 137

npm ERR!

npm ERR! Failed at the openproject-frontend@0.1.0 build script.

npm ERR! This is probably not a problem with npm. There is likely additional logging output above.

npm ERR! A complete log of this run can be found in:

npm ERR! /home/pkgr/.npm/_logs/2021-11-22T10_09_39_236Z-debug.log

rake aborted!

Failed to compile angular frontend: 137

/tmp/d20211122-58-13lcvdf/opt/openproject/lib/tasks/assets.rake:70:in `block (4 levels) in <top (required)>'

/tmp/d20211122-58-13lcvdf/opt/openproject/lib/tasks/assets.rake:69:in `block (3 levels) in <top (required)>'

/tmp/d20211122-58-13lcvdf/opt/openproject/lib/tasks/assets.rake:68:in `chdir'

/tmp/d20211122-58-13lcvdf/opt/openproject/lib/tasks/assets.rake:68:in `block (2 levels) in <top (required)>'

/tmp/d20211122-58-13lcvdf/opt/openproject/vendor/bundle/ruby/2.7.0/gems/rake-13.0.6/exe/rake:27:in `<top (required)>'

Tasks: TOP => assets:precompile => assets:compile_environment => assets:prepare_op => assets:angular

(See full trace by running task with --trace)



!

! Precompiling assets failed.

! Attempted to access a nonexistent database:

! https://devcenter.heroku.com/articles/pre-provision-database

!

! ERROR: compile failed

ERROR

TIMEOUT

tar: This does not look like a tar archive

tar: Exiting with failure status due to previous errors

! FAILED - Build error.

! Please contact support.