Debian 10 Buster 64bits

Logs

====== Attempt #1

-----> Fetching repository

Cloning into '/tmp/d20211130-6-hjbb1r/input'...

Checking out files: 32% (3674/11160) Checking out files: 33% (3683/11160) Checking out files: 34% (3795/11160) Checking out files: 35% (3906/11160) Checking out files: 36% (4018/11160) Checking out files: 37% (4130/11160) Checking out files: 38% (4241/11160) Checking out files: 39% (4353/11160) Checking out files: 40% (4464/11160) Checking out files: 41% (4576/11160) Checking out files: 42% (4688/11160) Checking out files: 43% (4799/11160) Checking out files: 44% (4911/11160) Checking out files: 45% (5022/11160) Checking out files: 46% (5134/11160) Checking out files: 47% (5246/11160) Checking out files: 48% (5357/11160) Checking out files: 49% (5469/11160) Checking out files: 50% (5580/11160) Checking out files: 51% (5692/11160) Checking out files: 52% (5804/11160) Checking out files: 53% (5915/11160) Checking out files: 54% (6027/11160) Checking out files: 55% (6138/11160) Checking out files: 56% (6250/11160) Checking out files: 57% (6362/11160) Checking out files: 58% (6473/11160) Checking out files: 59% (6585/11160) Checking out files: 60% (6696/11160) Checking out files: 61% (6808/11160) Checking out files: 62% (6920/11160) Checking out files: 63% (7031/11160) Checking out files: 64% (7143/11160) Checking out files: 65% (7254/11160) Checking out files: 66% (7366/11160) Checking out files: 67% (7478/11160) Checking out files: 68% (7589/11160) Checking out files: 69% (7701/11160) Checking out files: 70% (7812/11160) Checking out files: 71% (7924/11160) Checking out files: 72% (8036/11160) Checking out files: 73% (8147/11160) Checking out files: 74% (8259/11160) Checking out files: 75% (8370/11160) Checking out files: 76% (8482/11160) Checking out files: 77% (8594/11160) Checking out files: 78% (8705/11160) Checking out files: 79% (8817/11160) Checking out files: 80% (8928/11160) Checking out files: 81% (9040/11160) Checking out files: 82% (9152/11160) Checking out files: 83% (9263/11160) Checking out files: 84% (9375/11160) Checking out files: 85% (9486/11160) Checking out files: 86% (9598/11160) Checking out files: 87% (9710/11160) Checking out files: 88% (9821/11160) Checking out files: 89% (9933/11160) Checking out files: 90% (10044/11160) Checking out files: 91% (10156/11160) Checking out files: 92% (10268/11160) Checking out files: 93% (10379/11160) Checking out files: 94% (10491/11160) Checking out files: 95% (10602/11160) Checking out files: 96% (10714/11160) Checking out files: 97% (10826/11160) Checking out files: 98% (10937/11160) Checking out files: 99% (11049/11160) Checking out files: 100% (11160/11160) Checking out files: 100% (11160/11160), done.

-----> Setting up package repository...

-----> Starting packaging process

-----> Starting service postgres...

-----> Additional environment variables

UUID=83d91346-1f94-4500-95d8-049d1fe1989e

DATABASE_URL=postgres://postgres:xVAkBZyDZYzfWUms@164.132.201.42:53127/postgres

DATABASE_HOST=164.132.201.42

DATABASE_PORT=53127

HOME=/home/pkgr

-----> Found valid cache

-----> Restoring cache...

-----> Fetching pkgr a146e2f5532e6add357965704e0f0313fe4b937e...

-----> Starting packaging process...

-----> Installing missing build dependencies: libsqlite3-dev

-----> [wizard] adding legacy-installer wizard (https://github.com/pkgr/addon-legacy-installer#master)

-----> [wizard] adding openproject-edition wizard (/tmp/d20211130-50-jcb75f/opt/openproject/packaging/addons/openproject-edition#)

-----> [wizard] adding postgres wizard (https://github.com/pkgr/addon-postgres#master)

-----> [wizard] adding apache2 wizard (https://github.com/pkgr/addon-apache2#master)

-----> [wizard] adding repositories wizard (/tmp/d20211130-50-jcb75f/opt/openproject/packaging/addons/repositories#)

-----> [wizard] adding smtp wizard (https://github.com/pkgr/addon-smtp#master)

-----> [wizard] adding memcached wizard (https://github.com/pkgr/addon-memcached#master)

-----> [wizard] adding openproject wizard (/tmp/d20211130-50-jcb75f/opt/openproject/packaging/addons/openproject#)

-----> Fetching buildpack https://github.com/opf/heroku-buildpack-multi.git at master

-----> Running hook: "packaging/setup"

-----> Multipack app

=====> Downloading Buildpack: https://github.com/heroku/heroku-buildpack-nodejs.git

=====> Detected Framework: Node.js

-----> Creating runtime environment

NPM_CONFIG_PRODUCTION=false

NPM_CONFIG_LOGLEVEL=error

NODE_VERBOSE=false

NODE_ENV=production

NODE_MODULES_CACHE=true

-----> Installing binaries

engines.node (package.json): ~14.17.0

engines.npm (package.json): ~6.14.13

Resolving node version ~14.17.0...

Downloading and installing node 14.17.6...

Bootstrapping npm ~6.14.13 (replacing 6.14.15)...

npm ~6.14.13 installed

-----> Restoring cache

- node_modules

-----> Installing dependencies

Installing node modules (package.json)

> openproject@0.1.0 postinstall /tmp/d20211130-50-jcb75f/opt/openproject

> cd frontend && npm install

npm ERR! code E404

npm ERR! 404 Not Found - GET https://registry.npmjs.org/@angular-devkit%2Fcore - Not found

npm ERR! 404

npm ERR! 404 '@angular-devkit/core@12.2.6' is not in the npm registry.

npm ERR! 404 You should bug the author to publish it (or use the name yourself!)

npm ERR! 404 It was specified as a dependency of 'frontend'

npm ERR! 404

npm ERR! 404 Note that you can also install from a

npm ERR! 404 tarball, folder, http url, or git url.

npm ERR! A complete log of this run can be found in:

npm ERR! /tmp/npmcache.i79IR/_logs/2021-11-30T12_23_15_054Z-debug.log

npm ERR! code ELIFECYCLE

npm ERR! errno 1

npm ERR! openproject@0.1.0 postinstall: `cd frontend && npm install`

npm ERR! Exit status 1

npm ERR!

npm ERR! Failed at the openproject@0.1.0 postinstall script.

npm ERR! This is probably not a problem with npm. There is likely additional logging output above.

npm ERR! A complete log of this run can be found in:

npm ERR! /tmp/npmcache.i79IR/_logs/2021-11-30T12_23_16_359Z-debug.log

-----> Build failed

We're sorry this build is failing! You can troubleshoot common issues here:

https://devcenter.heroku.com/articles/troubleshooting-node-deploys

If you're stuck, please submit a ticket so we can help:

https://help.heroku.com/

Love,

Heroku

! ERROR: compile failed

Failed to package application

tar: This does not look like a tar archive

tar: Exiting with failure status due to previous errors

! FAILED - Build error.

! Please contact support.