Debian 11 Bullseye 64bits

Logs

====== Attempt #1

-----> Fetching repository

Cloning into '/tmp/d20220616-6-1pxbcc0/input'...

Updating files: 57% (7209/12456) Updating files: 58% (7225/12456) Updating files: 59% (7350/12456) Updating files: 60% (7474/12456) Updating files: 61% (7599/12456) Updating files: 62% (7723/12456) Updating files: 63% (7848/12456) Updating files: 64% (7972/12456) Updating files: 65% (8097/12456) Updating files: 66% (8221/12456) Updating files: 67% (8346/12456) Updating files: 68% (8471/12456) Updating files: 69% (8595/12456) Updating files: 70% (8720/12456) Updating files: 71% (8844/12456) Updating files: 72% (8969/12456) Updating files: 73% (9093/12456) Updating files: 74% (9218/12456) Updating files: 75% (9342/12456) Updating files: 76% (9467/12456) Updating files: 77% (9592/12456) Updating files: 78% (9716/12456) Updating files: 79% (9841/12456) Updating files: 80% (9965/12456) Updating files: 81% (10090/12456) Updating files: 82% (10214/12456) Updating files: 83% (10339/12456) Updating files: 84% (10464/12456) Updating files: 85% (10588/12456) Updating files: 86% (10713/12456) Updating files: 87% (10837/12456) Updating files: 88% (10962/12456) Updating files: 89% (11086/12456) Updating files: 90% (11211/12456) Updating files: 91% (11335/12456) Updating files: 92% (11460/12456) Updating files: 93% (11585/12456) Updating files: 94% (11709/12456) Updating files: 95% (11834/12456) Updating files: 96% (11958/12456) Updating files: 97% (12083/12456) Updating files: 98% (12207/12456) Updating files: 99% (12332/12456) Updating files: 100% (12456/12456) Updating files: 100% (12456/12456), done.

-----> Setting up package repository...

-----> Starting packaging process

-----> Starting service postgres...

-----> Additional environment variables

UUID=f5c56323-7080-452c-894a-32d07e04f674

DATABASE_URL=postgres://postgres:qfiigQrbTY4yCK5m@65.108.144.194:59125/postgres

DATABASE_HOST=65.108.144.194

DATABASE_PORT=59125

HOME=/home/pkgr

-----> Empty or invalid cache

-----> Fetching pkgr 9b3d9a783820ebcd5786896b3dd77f374c30c8b8...

-----> Starting packaging process...

-----> Installing missing build dependencies: libsqlite3-dev

-----> [wizard] adding legacy-installer wizard (https://github.com/pkgr/addon-legacy-installer#master)

-----> [wizard] adding openproject-edition wizard (/tmp/d20220616-57-coowru/opt/openproject/packaging/addons/openproject-edition#)

-----> [wizard] adding postgres wizard (https://github.com/pkgr/addon-postgres#master)

-----> [wizard] adding apache2 wizard (https://github.com/pkgr/addon-apache2#master)

-----> [wizard] adding repositories wizard (/tmp/d20220616-57-coowru/opt/openproject/packaging/addons/repositories#)

-----> [wizard] adding memcached wizard (https://github.com/pkgr/addon-memcached#master)

-----> [wizard] adding openproject wizard (/tmp/d20220616-57-coowru/opt/openproject/packaging/addons/openproject#)

-----> Fetching buildpack https://github.com/opf/heroku-buildpack-multi.git at master

-----> Running hook: "packaging/setup"

-----> Multipack app

=====> Downloading Buildpack: https://github.com/heroku/heroku-buildpack-nodejs.git

=====> Detected Framework: Node.js

-----> Creating runtime environment

NPM_CONFIG_PRODUCTION=false

NPM_CONFIG_LOGLEVEL=error

NODE_VERBOSE=false

NODE_ENV=production

NODE_MODULES_CACHE=true

-----> Installing binaries

engines.node (package.json): ~16.15.1

engines.npm (package.json): ~8.12.1

Resolving node version ~16.15.1...

Downloading and installing node 16.15.1...

Bootstrapping npm ~8.12.1 (replacing 8.11.0)...

npm ~8.12.1 installed

-----> Installing dependencies

Installing node modules (package.json)

> openproject@0.1.0 postinstall

> cd frontend && npm install

npm ERR! Cannot read properties of null (reading 'pickAlgorithm')

npm ERR! A complete log of this run can be found in:

npm ERR! /tmp/npmcache.M6puI/_logs/2022-06-16T07_13_51_264Z-debug-0.log

npm ERR! code 1

npm ERR! path /tmp/d20220616-57-coowru/opt/openproject

npm ERR! command failed

npm ERR! command sh -c cd frontend && npm install

npm ERR! A complete log of this run can be found in:

npm ERR! /tmp/npmcache.M6puI/_logs/2022-06-16T07_13_42_928Z-debug-0.log

-----> Build failed

We're sorry this build is failing! You can troubleshoot common issues here:

https://devcenter.heroku.com/articles/troubleshooting-node-deploys

If you're stuck, please submit a ticket so we can help:

https://help.heroku.com/

Love,

Heroku

! ERROR: compile failed

Failed to package application

tar: This does not look like a tar archive

tar: Exiting with failure status due to previous errors

! FAILED - Build error.

! Please contact support.