CentOS / RHEL 7 64 bits

Logs

====== Attempt #1

-----> Fetching repository

Cloning into '/tmp/d20220616-6-s9qopa/input'...

Updating files: 47% (5868/12456) Updating files: 48% (5979/12456) Updating files: 49% (6104/12456) Updating files: 50% (6228/12456) Updating files: 51% (6353/12456) Updating files: 52% (6478/12456) Updating files: 53% (6602/12456) Updating files: 54% (6727/12456) Updating files: 55% (6851/12456) Updating files: 56% (6976/12456) Updating files: 57% (7100/12456) Updating files: 58% (7225/12456) Updating files: 59% (7350/12456) Updating files: 60% (7474/12456) Updating files: 61% (7599/12456) Updating files: 62% (7723/12456) Updating files: 63% (7848/12456) Updating files: 64% (7972/12456) Updating files: 65% (8097/12456) Updating files: 66% (8221/12456) Updating files: 67% (8346/12456) Updating files: 68% (8471/12456) Updating files: 69% (8595/12456) Updating files: 70% (8720/12456) Updating files: 71% (8844/12456) Updating files: 72% (8969/12456) Updating files: 73% (9093/12456) Updating files: 74% (9218/12456) Updating files: 75% (9342/12456) Updating files: 76% (9467/12456) Updating files: 77% (9592/12456) Updating files: 78% (9716/12456) Updating files: 79% (9841/12456) Updating files: 80% (9965/12456) Updating files: 81% (10090/12456) Updating files: 82% (10214/12456) Updating files: 83% (10339/12456) Updating files: 84% (10464/12456) Updating files: 85% (10588/12456) Updating files: 86% (10713/12456) Updating files: 87% (10837/12456) Updating files: 88% (10962/12456) Updating files: 89% (11086/12456) Updating files: 90% (11211/12456) Updating files: 91% (11335/12456) Updating files: 92% (11460/12456) Updating files: 93% (11585/12456) Updating files: 94% (11709/12456) Updating files: 95% (11834/12456) Updating files: 96% (11958/12456) Updating files: 97% (12083/12456) Updating files: 98% (12207/12456) Updating files: 99% (12332/12456) Updating files: 100% (12456/12456) Updating files: 100% (12456/12456), done.

-----> Setting up package repository...

-----> Starting packaging process

-----> Starting service postgres...

-----> Additional environment variables

UUID=17f4108a-5561-4365-91cb-2bcf9d37460a

DATABASE_URL=postgres://postgres:izFdYp1be_s0T11a@65.108.144.194:59129/postgres

DATABASE_HOST=65.108.144.194

DATABASE_PORT=59129

HOME=/home/pkgr

-----> Empty or invalid cache

-----> Fetching pkgr 9b3d9a783820ebcd5786896b3dd77f374c30c8b8...

-----> Starting packaging process...

-----> Installing missing build dependencies: postgresql-devel

-----> [wizard] adding legacy-installer wizard (https://github.com/pkgr/addon-legacy-installer#master)

-----> [wizard] adding openproject-edition wizard (/tmp/d20220616-34-1cfm96/opt/openproject/packaging/addons/openproject-edition#)

-----> [wizard] adding postgres wizard (https://github.com/pkgr/addon-postgres#master)

-----> [wizard] adding apache2 wizard (https://github.com/pkgr/addon-apache2#master)

-----> [wizard] adding repositories wizard (/tmp/d20220616-34-1cfm96/opt/openproject/packaging/addons/repositories#)

-----> [wizard] adding memcached wizard (https://github.com/pkgr/addon-memcached#master)

-----> [wizard] adding openproject wizard (/tmp/d20220616-34-1cfm96/opt/openproject/packaging/addons/openproject#)

-----> Fetching buildpack https://github.com/opf/heroku-buildpack-multi.git at master

-----> Running hook: "packaging/setup"

Loaded plugins: fastestmirror, ovl

Resolving Dependencies

--> Running transaction check

---> Package postgresql-devel.x86_64 0:9.2.24-7.el7_9 will be erased

--> Finished Dependency Resolution

Dependencies Resolved

================================================================================

Package Arch Version Repository Size

================================================================================

Removing:

postgresql-devel x86_64 9.2.24-7.el7_9 @updates 4.0 M

Transaction Summary

================================================================================

Remove 1 Package

Installed size: 4.0 M

Downloading packages:

Running transaction check

Running transaction test

Transaction test succeeded

Running transaction

Erasing : postgresql-devel-9.2.24-7.el7_9.x86_64 1/1

Verifying : postgresql-devel-9.2.24-7.el7_9.x86_64 1/1

Removed:

postgresql-devel.x86_64 0:9.2.24-7.el7_9

Complete!

Loaded plugins: fastestmirror, ovl

Examining /var/tmp/yum-root-IQOUrO/pgdg-redhat-repo-latest.noarch.rpm: pgdg-redhat-repo-42.0-24.noarch

/var/tmp/yum-root-IQOUrO/pgdg-redhat-repo-latest.noarch.rpm: does not update installed package.

Error: Nothing to do

Loaded plugins: fastestmirror, ovl

Loading mirror speeds from cached hostfile

* base: mirror.hosthink.net

* epel: mirror.23m.com

* extras: mirror.hosthink.net

* updates: ftp.funet.fi

Resolving Dependencies

--> Running transaction check

---> Package centos-release-scl-rh.noarch 0:2-3.el7.centos will be installed

--> Finished Dependency Resolution

Dependencies Resolved

================================================================================

Package Arch Version Repository Size

================================================================================

Installing:

centos-release-scl-rh noarch 2-3.el7.centos extras 12 k

Transaction Summary

================================================================================

Install 1 Package

Total download size: 12 k

Installed size: 20 k

Downloading packages:

Running transaction check

Running transaction test

Transaction test succeeded

Running transaction

Installing : centos-release-scl-rh-2-3.el7.centos.noarch 1/1

Verifying : centos-release-scl-rh-2-3.el7.centos.noarch 1/1

Installed:

centos-release-scl-rh.noarch 0:2-3.el7.centos

Complete!

Loaded plugins: fastestmirror, ovl

Loading mirror speeds from cached hostfile

* base: mirror.hosthink.net

* centos-sclo-rh: ftp.funet.fi

* epel: mirror.23m.com

* extras: mirror.hosthink.net

* updates: ftp.funet.fi

Resolving Dependencies

--> Running transaction check

---> Package postgresql13-devel.x86_64 0:13.7-1PGDG.rhel7 will be installed

--> Processing Dependency: postgresql13-libs(x86-64) = 13.7-1PGDG.rhel7 for package: postgresql13-devel-13.7-1PGDG.rhel7.x86_64

--> Processing Dependency: postgresql13(x86-64) = 13.7-1PGDG.rhel7 for package: postgresql13-devel-13.7-1PGDG.rhel7.x86_64

--> Processing Dependency: llvm5.0-devel >= 5.0 for package: postgresql13-devel-13.7-1PGDG.rhel7.x86_64

--> Processing Dependency: llvm-toolset-7-clang >= 4.0.1 for package: postgresql13-devel-13.7-1PGDG.rhel7.x86_64

--> Running transaction check

---> Package llvm-toolset-7-clang.x86_64 0:5.0.1-4.el7 will be installed

--> Processing Dependency: llvm-toolset-7-clang-libs(x86-64) = 5.0.1-4.el7 for package: llvm-toolset-7-clang-5.0.1-4.el7.x86_64

--> Processing Dependency: libLLVM-5.0.so(LLVM_5.0)(64bit) for package: llvm-toolset-7-clang-5.0.1-4.el7.x86_64

--> Processing Dependency: libclang.so.5(LLVM_5.0)(64bit) for package: llvm-toolset-7-clang-5.0.1-4.el7.x86_64

--> Processing Dependency: llvm-toolset-7-runtime for package: llvm-toolset-7-clang-5.0.1-4.el7.x86_64

--> Processing Dependency: libLLVM-5.0.so()(64bit) for package: llvm-toolset-7-clang-5.0.1-4.el7.x86_64

--> Processing Dependency: libclang.so.5()(64bit) for package: llvm-toolset-7-clang-5.0.1-4.el7.x86_64

--> Processing Dependency: libclangAST.so.5()(64bit) for package: llvm-toolset-7-clang-5.0.1-4.el7.x86_64

--> Processing Dependency: libclangBasic.so.5()(64bit) for package: llvm-toolset-7-clang-5.0.1-4.el7.x86_64

--> Processing Dependency: libclangCodeGen.so.5()(64bit) for package: llvm-toolset-7-clang-5.0.1-4.el7.x86_64

--> Processing Dependency: libclangDriver.so.5()(64bit) for package: llvm-toolset-7-clang-5.0.1-4.el7.x86_64

--> Processing Dependency: libclangFormat.so.5()(64bit) for package: llvm-toolset-7-clang-5.0.1-4.el7.x86_64

--> Processing Dependency: libclangFrontend.so.5()(64bit) for package: llvm-toolset-7-clang-5.0.1-4.el7.x86_64

--> Processing Dependency: libclangFrontendTool.so.5()(64bit) for package: llvm-toolset-7-clang-5.0.1-4.el7.x86_64

--> Processing Dependency: libclangIndex.so.5()(64bit) for package: llvm-toolset-7-clang-5.0.1-4.el7.x86_64

--> Processing Dependency: libclangLex.so.5()(64bit) for package: llvm-toolset-7-clang-5.0.1-4.el7.x86_64

--> Processing Dependency: libclangParse.so.5()(64bit) for package: llvm-toolset-7-clang-5.0.1-4.el7.x86_64

--> Processing Dependency: libclangRewrite.so.5()(64bit) for package: llvm-toolset-7-clang-5.0.1-4.el7.x86_64

--> Processing Dependency: libclangRewriteFrontend.so.5()(64bit) for package: llvm-toolset-7-clang-5.0.1-4.el7.x86_64

--> Processing Dependency: libclangSerialization.so.5()(64bit) for package: llvm-toolset-7-clang-5.0.1-4.el7.x86_64

--> Processing Dependency: libclangStaticAnalyzerFrontend.so.5()(64bit) for package: llvm-toolset-7-clang-5.0.1-4.el7.x86_64

--> Processing Dependency: libclangTooling.so.5()(64bit) for package: llvm-toolset-7-clang-5.0.1-4.el7.x86_64

--> Processing Dependency: libclangToolingCore.so.5()(64bit) for package: llvm-toolset-7-clang-5.0.1-4.el7.x86_64

---> Package llvm5.0-devel.x86_64 0:5.0.1-7.el7 will be installed

--> Processing Dependency: llvm5.0(x86-64) = 5.0.1-7.el7 for package: llvm5.0-devel-5.0.1-7.el7.x86_64

--> Processing Dependency: libedit-devel for package: llvm5.0-devel-5.0.1-7.el7.x86_64

---> Package postgresql13.x86_64 0:13.7-1PGDG.rhel7 will be installed

---> Package postgresql13-libs.x86_64 0:13.7-1PGDG.rhel7 will be installed

--> Running transaction check

---> Package libedit-devel.x86_64 0:3.0-12.20121213cvs.el7 will be installed

---> Package llvm-toolset-7-clang-libs.x86_64 0:5.0.1-4.el7 will be installed

--> Processing Dependency: llvm-toolset-7-compiler-rt(x86-64) >= 5.0.1 for package: llvm-toolset-7-clang-libs-5.0.1-4.el7.x86_64

--> Processing Dependency: llvm-toolset-7-libomp(x86-64) >= 5.0.1 for package: llvm-toolset-7-clang-libs-5.0.1-4.el7.x86_64

--> Processing Dependency: devtoolset-7-gcc-c++ for package: llvm-toolset-7-clang-libs-5.0.1-4.el7.x86_64

--> Processing Dependency: devtoolset-7-libstdc++-devel for package: llvm-toolset-7-clang-libs-5.0.1-4.el7.x86_64

---> Package llvm-toolset-7-llvm-libs.x86_64 0:5.0.1-8.el7 will be installed

---> Package llvm-toolset-7-runtime.x86_64 0:5.0.1-4.el7 will be installed

--> Processing Dependency: scl-utils for package: llvm-toolset-7-runtime-5.0.1-4.el7.x86_64

---> Package llvm5.0.x86_64 0:5.0.1-7.el7 will be installed

--> Processing Dependency: llvm5.0-libs(x86-64) = 5.0.1-7.el7 for package: llvm5.0-5.0.1-7.el7.x86_64

--> Running transaction check

---> Package devtoolset-7-gcc-c++.x86_64 0:7.3.1-5.16.el7 will be installed

--> Processing Dependency: devtoolset-7-gcc = 7.3.1-5.16.el7 for package: devtoolset-7-gcc-c++-7.3.1-5.16.el7.x86_64

--> Processing Dependency: devtoolset-7-runtime for package: devtoolset-7-gcc-c++-7.3.1-5.16.el7.x86_64

---> Package devtoolset-7-libstdc++-devel.x86_64 0:7.3.1-5.16.el7 will be installed

---> Package llvm-toolset-7-compiler-rt.x86_64 0:5.0.1-2.el7 will be installed

---> Package llvm-toolset-7-libomp.x86_64 0:5.0.1-2.el7 will be installed

---> Package llvm5.0-libs.x86_64 0:5.0.1-7.el7 will be installed

---> Package scl-utils.x86_64 0:20130529-19.el7 will be installed

--> Running transaction check

---> Package devtoolset-7-gcc.x86_64 0:7.3.1-5.16.el7 will be installed

--> Processing Dependency: devtoolset-7-binutils >= 2.22.52.0.1 for package: devtoolset-7-gcc-7.3.1-5.16.el7.x86_64

---> Package devtoolset-7-runtime.x86_64 0:7.1-4.el7 will be installed

--> Processing Dependency: /usr/sbin/restorecon for package: devtoolset-7-runtime-7.1-4.el7.x86_64

--> Processing Dependency: /usr/sbin/restorecon for package: devtoolset-7-runtime-7.1-4.el7.x86_64

--> Processing Dependency: /usr/sbin/semanage for package: devtoolset-7-runtime-7.1-4.el7.x86_64

--> Processing Dependency: /usr/sbin/semanage for package: devtoolset-7-runtime-7.1-4.el7.x86_64

--> Running transaction check

---> Package devtoolset-7-binutils.x86_64 0:2.28-11.el7 will be installed

---> Package policycoreutils.x86_64 0:2.5-34.el7 will be installed

--> Processing Dependency: libselinux-utils >= 2.5-14 for package: policycoreutils-2.5-34.el7.x86_64

---> Package policycoreutils-python.x86_64 0:2.5-34.el7 will be installed

--> Processing Dependency: setools-libs >= 3.3.8-4 for package: policycoreutils-python-2.5-34.el7.x86_64

--> Processing Dependency: libsemanage-python >= 2.5-14 for package: policycoreutils-python-2.5-34.el7.x86_64

--> Processing Dependency: audit-libs-python >= 2.1.3-4 for package: policycoreutils-python-2.5-34.el7.x86_64

--> Processing Dependency: python-IPy for package: policycoreutils-python-2.5-34.el7.x86_64

--> Processing Dependency: libselinux-python for package: policycoreutils-python-2.5-34.el7.x86_64

--> Processing Dependency: libqpol.so.1(VERS_1.4)(64bit) for package: policycoreutils-python-2.5-34.el7.x86_64

--> Processing Dependency: libqpol.so.1(VERS_1.2)(64bit) for package: policycoreutils-python-2.5-34.el7.x86_64

--> Processing Dependency: libcgroup for package: policycoreutils-python-2.5-34.el7.x86_64

--> Processing Dependency: libapol.so.4(VERS_4.0)(64bit) for package: policycoreutils-python-2.5-34.el7.x86_64

--> Processing Dependency: checkpolicy for package: policycoreutils-python-2.5-34.el7.x86_64

--> Processing Dependency: libqpol.so.1()(64bit) for package: policycoreutils-python-2.5-34.el7.x86_64

--> Processing Dependency: libapol.so.4()(64bit) for package: policycoreutils-python-2.5-34.el7.x86_64

--> Running transaction check

---> Package audit-libs-python.x86_64 0:2.8.5-4.el7 will be installed

---> Package checkpolicy.x86_64 0:2.5-8.el7 will be installed

---> Package libcgroup.x86_64 0:0.41-21.el7 will be installed

---> Package libselinux-python.x86_64 0:2.5-15.el7 will be installed

---> Package libselinux-utils.x86_64 0:2.5-15.el7 will be installed

---> Package libsemanage-python.x86_64 0:2.5-14.el7 will be installed

---> Package python-IPy.noarch 0:0.75-6.el7 will be installed

---> Package setools-libs.x86_64 0:3.3.8-4.el7 will be installed

--> Finished Dependency Resolution

Dependencies Resolved

================================================================================

Package Arch Version Repository Size

================================================================================

Installing:

postgresql13-devel x86_64 13.7-1PGDG.rhel7 pgdg13 2.4 M

Installing for dependencies:

audit-libs-python x86_64 2.8.5-4.el7 base 76 k

checkpolicy x86_64 2.5-8.el7 base 295 k

devtoolset-7-binutils x86_64 2.28-11.el7 centos-sclo-rh 5.3 M

devtoolset-7-gcc x86_64 7.3.1-5.16.el7 centos-sclo-rh 29 M

devtoolset-7-gcc-c++ x86_64 7.3.1-5.16.el7 centos-sclo-rh 11 M

devtoolset-7-libstdc++-devel

x86_64 7.3.1-5.16.el7 centos-sclo-rh 2.5 M

devtoolset-7-runtime x86_64 7.1-4.el7 centos-sclo-rh 20 k

libcgroup x86_64 0.41-21.el7 base 66 k

libedit-devel x86_64 3.0-12.20121213cvs.el7 base 32 k

libselinux-python x86_64 2.5-15.el7 base 236 k

libselinux-utils x86_64 2.5-15.el7 base 151 k

libsemanage-python x86_64 2.5-14.el7 base 113 k

llvm-toolset-7-clang x86_64 5.0.1-4.el7 centos-sclo-rh 545 k

llvm-toolset-7-clang-libs x86_64 5.0.1-4.el7 centos-sclo-rh 13 M

llvm-toolset-7-compiler-rt x86_64 5.0.1-2.el7 centos-sclo-rh 1.7 M

llvm-toolset-7-libomp x86_64 5.0.1-2.el7 centos-sclo-rh 246 k

llvm-toolset-7-llvm-libs x86_64 5.0.1-8.el7 centos-sclo-rh 13 M

llvm-toolset-7-runtime x86_64 5.0.1-4.el7 centos-sclo-rh 1.1 M

llvm5.0 x86_64 5.0.1-7.el7 epel 2.6 M

llvm5.0-devel x86_64 5.0.1-7.el7 epel 2.3 M

llvm5.0-libs x86_64 5.0.1-7.el7 epel 13 M

policycoreutils x86_64 2.5-34.el7 base 917 k

policycoreutils-python x86_64 2.5-34.el7 base 457 k

postgresql13 x86_64 13.7-1PGDG.rhel7 pgdg13 1.4 M

postgresql13-libs x86_64 13.7-1PGDG.rhel7 pgdg13 384 k

python-IPy noarch 0.75-6.el7 base 32 k

scl-utils x86_64 20130529-19.el7 base 24 k

setools-libs x86_64 3.3.8-4.el7 base 620 k

Transaction Summary

================================================================================

Install 1 Package (+28 Dependent packages)

Total download size: 103 M

Installed size: 357 M

Downloading packages:

warning: /var/cache/yum/x86_64/7/centos-sclo-rh/packages/devtoolset-7-binutils-2.28-11.el7.x86_64.rpm: Header V4 RSA/SHA1 Signature, key ID f2ee9d55: NOKEY

Public key for devtoolset-7-binutils-2.28-11.el7.x86_64.rpm is not installed

warning: /var/cache/yum/x86_64/7/epel/packages/llvm5.0-5.0.1-7.el7.x86_64.rpm: Header V3 RSA/SHA256 Signature, key ID 352c64e5: NOKEY

Public key for llvm5.0-5.0.1-7.el7.x86_64.rpm is not installed

--------------------------------------------------------------------------------

Total 33 MB/s | 103 MB 00:03

Retrieving key from file:///etc/pki/rpm-gpg/RPM-GPG-KEY-CentOS-SIG-SCLo

Importing GPG key 0xF2EE9D55:

Userid : "CentOS SoftwareCollections SIG (https://wiki.centos.org/SpecialInterestGroup/SCLo) <security@centos.org>"

Fingerprint: c4db d535 b1fb ba14 f8ba 64a8 4eb8 4e71 f2ee 9d55

Package : centos-release-scl-rh-2-3.el7.centos.noarch (@extras)

From : /etc/pki/rpm-gpg/RPM-GPG-KEY-CentOS-SIG-SCLo

Retrieving key from file:///etc/pki/rpm-gpg/RPM-GPG-KEY-EPEL-7

Importing GPG key 0x352C64E5:

Userid : "Fedora EPEL (7) <epel@fedoraproject.org>"

Fingerprint: 91e9 7d7c 4a5e 96f1 7f3e 888f 6a2f aea2 352c 64e5

Package : epel-release-7-11.noarch (@extras)

From : /etc/pki/rpm-gpg/RPM-GPG-KEY-EPEL-7

Running transaction check

Running transaction test

Transaction test succeeded

Running transaction

Installing : llvm5.0-libs-5.0.1-7.el7.x86_64 1/29

Installing : scl-utils-20130529-19.el7.x86_64 2/29

Installing : llvm-toolset-7-runtime-5.0.1-4.el7.x86_64 3/29

Installing : llvm-toolset-7-llvm-libs-5.0.1-8.el7.x86_64 4/29

Installing : postgresql13-libs-13.7-1PGDG.rhel7.x86_64 5/29

Installing : postgresql13-13.7-1PGDG.rhel7.x86_64 6/29

failed to link /usr/bin/psql -> /etc/alternatives/pgsql-psql: /usr/bin/psql exists and it is not a symlink

failed to link /usr/bin/clusterdb -> /etc/alternatives/pgsql-clusterdb: /usr/bin/clusterdb exists and it is not a symlink

failed to link /usr/bin/createdb -> /etc/alternatives/pgsql-createdb: /usr/bin/createdb exists and it is not a symlink

failed to link /usr/bin/createuser -> /etc/alternatives/pgsql-createuser: /usr/bin/createuser exists and it is not a symlink

failed to link /usr/bin/dropdb -> /etc/alternatives/pgsql-dropdb: /usr/bin/dropdb exists and it is not a symlink

failed to link /usr/bin/dropuser -> /etc/alternatives/pgsql-dropuser: /usr/bin/dropuser exists and it is not a symlink

failed to link /usr/bin/pg_dump -> /etc/alternatives/pgsql-pg_dump: /usr/bin/pg_dump exists and it is not a symlink

failed to link /usr/bin/pg_dumpall -> /etc/alternatives/pgsql-pg_dumpall: /usr/bin/pg_dumpall exists and it is not a symlink

failed to link /usr/bin/pg_restore -> /etc/alternatives/pgsql-pg_restore: /usr/bin/pg_restore exists and it is not a symlink

failed to link /usr/bin/reindexdb -> /etc/alternatives/pgsql-reindexdb: /usr/bin/reindexdb exists and it is not a symlink

failed to link /usr/bin/vacuumdb -> /etc/alternatives/pgsql-vacuumdb: /usr/bin/vacuumdb exists and it is not a symlink

Installing : llvm-toolset-7-compiler-rt-5.0.1-2.el7.x86_64 7/29

Installing : llvm-toolset-7-libomp-5.0.1-2.el7.x86_64 8/29

Installing : llvm5.0-5.0.1-7.el7.x86_64 9/29

Installing : libcgroup-0.41-21.el7.x86_64 10/29

Installing : libedit-devel-3.0-12.20121213cvs.el7.x86_64 11/29

Installing : llvm5.0-devel-5.0.1-7.el7.x86_64 12/29

Installing : audit-libs-python-2.8.5-4.el7.x86_64 13/29

Installing : libselinux-python-2.5-15.el7.x86_64 14/29

Installing : libsemanage-python-2.5-14.el7.x86_64 15/29

Installing : setools-libs-3.3.8-4.el7.x86_64 16/29

Installing : libselinux-utils-2.5-15.el7.x86_64 17/29

Installing : policycoreutils-2.5-34.el7.x86_64 18/29

Installing : python-IPy-0.75-6.el7.noarch 19/29

Installing : checkpolicy-2.5-8.el7.x86_64 20/29

Installing : policycoreutils-python-2.5-34.el7.x86_64 21/29

Installing : devtoolset-7-runtime-7.1-4.el7.x86_64 22/29

ValueError: SELinux policy is not managed or store cannot be accessed.

Installing : devtoolset-7-libstdc++-devel-7.3.1-5.16.el7.x86_64 23/29

Installing : devtoolset-7-binutils-2.28-11.el7.x86_64 24/29

install-info: No such file or directory for /opt/rh/devtoolset-7/root/usr/share/info/as.info.gz

install-info: No such file or directory for /opt/rh/devtoolset-7/root/usr/share/info/binutils.info.gz

install-info: No such file or directory for /opt/rh/devtoolset-7/root/usr/share/info/gprof.info.gz

install-info: No such file or directory for /opt/rh/devtoolset-7/root/usr/share/info/ld.info.gz

Installing : devtoolset-7-gcc-7.3.1-5.16.el7.x86_64 25/29

Installing : devtoolset-7-gcc-c++-7.3.1-5.16.el7.x86_64 26/29

Installing : llvm-toolset-7-clang-libs-5.0.1-4.el7.x86_64 27/29

Installing : llvm-toolset-7-clang-5.0.1-4.el7.x86_64 28/29

Installing : postgresql13-devel-13.7-1PGDG.rhel7.x86_64 29/29

Verifying : postgresql13-13.7-1PGDG.rhel7.x86_64 1/29

Verifying : checkpolicy-2.5-8.el7.x86_64 2/29

Verifying : postgresql13-libs-13.7-1PGDG.rhel7.x86_64 3/29

Verifying : llvm-toolset-7-clang-libs-5.0.1-4.el7.x86_64 4/29

Verifying : llvm-toolset-7-runtime-5.0.1-4.el7.x86_64 5/29

Verifying : policycoreutils-2.5-34.el7.x86_64 6/29

Verifying : llvm5.0-devel-5.0.1-7.el7.x86_64 7/29

Verifying : python-IPy-0.75-6.el7.noarch 8/29

Verifying : libselinux-utils-2.5-15.el7.x86_64 9/29

Verifying : policycoreutils-python-2.5-34.el7.x86_64 10/29

Verifying : setools-libs-3.3.8-4.el7.x86_64 11/29

Verifying : devtoolset-7-runtime-7.1-4.el7.x86_64 12/29

Verifying : llvm-toolset-7-clang-5.0.1-4.el7.x86_64 13/29

Verifying : devtoolset-7-gcc-7.3.1-5.16.el7.x86_64 14/29

Verifying : libsemanage-python-2.5-14.el7.x86_64 15/29

Verifying : devtoolset-7-binutils-2.28-11.el7.x86_64 16/29

Verifying : devtoolset-7-libstdc++-devel-7.3.1-5.16.el7.x86_64 17/29

Verifying : libselinux-python-2.5-15.el7.x86_64 18/29

Verifying : llvm-toolset-7-compiler-rt-5.0.1-2.el7.x86_64 19/29

Verifying : postgresql13-devel-13.7-1PGDG.rhel7.x86_64 20/29

Verifying : audit-libs-python-2.8.5-4.el7.x86_64 21/29

Verifying : llvm5.0-5.0.1-7.el7.x86_64 22/29

Verifying : scl-utils-20130529-19.el7.x86_64 23/29

Verifying : llvm-toolset-7-libomp-5.0.1-2.el7.x86_64 24/29

Verifying : libedit-devel-3.0-12.20121213cvs.el7.x86_64 25/29

Verifying : llvm5.0-libs-5.0.1-7.el7.x86_64 26/29

Verifying : llvm-toolset-7-llvm-libs-5.0.1-8.el7.x86_64 27/29

Verifying : devtoolset-7-gcc-c++-7.3.1-5.16.el7.x86_64 28/29

Verifying : libcgroup-0.41-21.el7.x86_64 29/29

Installed:

postgresql13-devel.x86_64 0:13.7-1PGDG.rhel7

Dependency Installed:

audit-libs-python.x86_64 0:2.8.5-4.el7

checkpolicy.x86_64 0:2.5-8.el7

devtoolset-7-binutils.x86_64 0:2.28-11.el7

devtoolset-7-gcc.x86_64 0:7.3.1-5.16.el7

devtoolset-7-gcc-c++.x86_64 0:7.3.1-5.16.el7

devtoolset-7-libstdc++-devel.x86_64 0:7.3.1-5.16.el7

devtoolset-7-runtime.x86_64 0:7.1-4.el7

libcgroup.x86_64 0:0.41-21.el7

libedit-devel.x86_64 0:3.0-12.20121213cvs.el7

libselinux-python.x86_64 0:2.5-15.el7

libselinux-utils.x86_64 0:2.5-15.el7

libsemanage-python.x86_64 0:2.5-14.el7

llvm-toolset-7-clang.x86_64 0:5.0.1-4.el7

llvm-toolset-7-clang-libs.x86_64 0:5.0.1-4.el7

llvm-toolset-7-compiler-rt.x86_64 0:5.0.1-2.el7

llvm-toolset-7-libomp.x86_64 0:5.0.1-2.el7

llvm-toolset-7-llvm-libs.x86_64 0:5.0.1-8.el7

llvm-toolset-7-runtime.x86_64 0:5.0.1-4.el7

llvm5.0.x86_64 0:5.0.1-7.el7

llvm5.0-devel.x86_64 0:5.0.1-7.el7

llvm5.0-libs.x86_64 0:5.0.1-7.el7

policycoreutils.x86_64 0:2.5-34.el7

policycoreutils-python.x86_64 0:2.5-34.el7

postgresql13.x86_64 0:13.7-1PGDG.rhel7

postgresql13-libs.x86_64 0:13.7-1PGDG.rhel7

python-IPy.noarch 0:0.75-6.el7

scl-utils.x86_64 0:20130529-19.el7

setools-libs.x86_64 0:3.3.8-4.el7

Complete!

-----> Multipack app

=====> Downloading Buildpack: https://github.com/heroku/heroku-buildpack-nodejs.git

=====> Detected Framework: Node.js

-----> Creating runtime environment

NPM_CONFIG_LOGLEVEL=error

NPM_CONFIG_PRODUCTION=false

NODE_VERBOSE=false

NODE_ENV=production

NODE_MODULES_CACHE=true

-----> Installing binaries

engines.node (package.json): ~16.15.1

engines.npm (package.json): ~8.12.1

Resolving node version ~16.15.1...

Downloading and installing node 16.15.1...

Bootstrapping npm ~8.12.1 (replacing 8.11.0)...

npm ~8.12.1 installed

-----> Installing dependencies

Installing node modules (package.json)

> openproject@0.1.0 postinstall

> cd frontend && npm install

npm ERR! Cannot read properties of null (reading 'pickAlgorithm')

npm ERR! A complete log of this run can be found in:

npm ERR! /tmp/npmcache.80QQA/_logs/2022-06-16T07_23_31_327Z-debug-0.log

npm ERR! code 1

npm ERR! path /tmp/d20220616-34-1cfm96/opt/openproject

npm ERR! command failed

npm ERR! command sh -c cd frontend && npm install

npm ERR! A complete log of this run can be found in:

npm ERR! /tmp/npmcache.80QQA/_logs/2022-06-16T07_23_20_937Z-debug-0.log

-----> Build failed

We're sorry this build is failing! You can troubleshoot common issues here:

https://devcenter.heroku.com/articles/troubleshooting-node-deploys

If you're stuck, please submit a ticket so we can help:

https://help.heroku.com/

Love,

Heroku

! ERROR: compile failed

Failed to package application

tar: This does not look like a tar archive

tar: Exiting with failure status due to previous errors

! FAILED - Build error.

! Please contact support.