Ubuntu Jammy 22.04 64 bits

Logs

====== Attempt #1

-----> Fetching repository

Cloning into '/tmp/d20220531-6-1kwebho/input'...

-----> Setting up package repository...

-----> Starting packaging process

-----> Additional environment variables

UUID=22254193-f3ec-4f24-a78e-4f225d14d8ca

HOME=/home/pkgr

-----> Empty or invalid cache

-----> Fetching pkgr efff93822a1641f3ba7427f5f529ccfec2e68e8a...

Build failed

gzip: stdin: unexpected end of file

tar: Child returned status 1

tar: Error is not recoverable: exiting now

! Unable to fetch pkgr. Aborting

Failed to package application

tar: This does not look like a tar archive

tar: Exiting with failure status due to previous errors

! FAILED - Build error.

! Please contact support.

====== Attempt #2

-----> Fetching repository

Cloning into '/tmp/d20220531-6-1c1koqv/input'...

-----> Setting up package repository...

-----> Starting packaging process

-----> Additional environment variables

UUID=3eda3a28-bbc1-4b65-b99e-0b558f843af3

HOME=/home/pkgr

-----> Empty or invalid cache

-----> Fetching pkgr efff93822a1641f3ba7427f5f529ccfec2e68e8a...

Build failed

gzip: stdin: unexpected end of file

tar: Child returned status 1

tar: Error is not recoverable: exiting now

! Unable to fetch pkgr. Aborting

Failed to package application

tar: This does not look like a tar archive

tar: Exiting with failure status due to previous errors

! FAILED - Build error.

! Please contact support.

====== Attempt #3

-----> Fetching repository

Cloning into '/tmp/d20220531-6-vdxr8u/input'...

-----> Setting up package repository...

-----> Starting packaging process

-----> Additional environment variables

UUID=7d4dfda6-b753-4321-9977-ff85d22bad37

HOME=/home/pkgr

-----> Empty or invalid cache

-----> Fetching pkgr efff93822a1641f3ba7427f5f529ccfec2e68e8a...

Build failed

gzip: stdin: unexpected end of file

tar: Child returned status 1

tar: Error is not recoverable: exiting now

! Unable to fetch pkgr. Aborting

Failed to package application

tar: This does not look like a tar archive

tar: Exiting with failure status due to previous errors

! FAILED - Build error.

! Please contact support.